BDBM63866 Bruceolide::MLS000728513::SMR000445627::cid_16745524
SMILES: [H][C@]12[C@@H](O)C(=O)O[C@]3([H])C[C@@]4([H])C(C)=C(O)C(=O)C[C@@]4(C)C4C(O)[C@H](O)[C@@]1(OC[C@@]234)C(=O)OC
InChI Key: InChIKey=YLWQKYSDNGHLAO-ARVIJVCNSA-N
Data: 3 IC50  1 EC50
Activity Spreadsheet -- Enzyme Inhibition Constant Data from BindingDB
Found 4 hits for monomerid = 63866
Trg + Lig
Ki
nM
ΔG°
kcal/mole
IC50
nM
Kd
nM
EC50/IC50
nM
koff
s-1
kon
M-1s-1
pHTemp
°C
Hsf1 protein
(Mus musculus)
BDBM63866
(Bruceolide | MLS000728513 | SMR000445627 | cid_167...)
Show SMILES [H][C@]12[C@@H](O)C(=O)O[C@]3([H])C[C@@]4([H])C(C)=C(O)C(=O)C[C@@]4(C)C4C(O)[C@H](O)[C@@]1(OC[C@@]234)C(=O)OC |t:13|
Show InChI InChI=1S/C21H26O10/c1-7-8-4-10-20-6-30-21(18(28)29-3,15(20)13(25)17(27)31-10)16(26)12(24)14(20)19(8,2)5-9(22)11(7)23/h8,10,12-16,23-26H,4-6H2,1-3H3/t8-,10+,12?,13+,14?,15+,16-,19+,20+,21+/m0/s1
PCBioAssay
n/an/an/an/a 1.01E+3n/an/an/an/a
Broad Institute
Curated by PubChem BioAssay
Assay Description
Keywords: Heat Shock Factor-1 (HSF-1), Stress Response, MG132, NIH3T3, Luminescence Assay Overview: Modified NIH3T3, transformed to express firefly...
PubChem Bioassay (2010)
BindingDB Entry DOI: 10.7270/Q2MW2FKX
XBP1
(Homo sapiens (Human))
BDBM63866
(Bruceolide | MLS000728513 | SMR000445627 | cid_167...)
Show SMILES [H][C@]12[C@@H](O)C(=O)O[C@]3([H])C[C@@]4([H])C(C)=C(O)C(=O)C[C@@]4(C)C4C(O)[C@H](O)[C@@]1(OC[C@@]234)C(=O)OC |t:13|
Show InChI InChI=1S/C21H26O10/c1-7-8-4-10-20-6-30-21(18(28)29-3,15(20)13(25)17(27)31-10)16(26)12(24)14(20)19(8,2)5-9(22)11(7)23/h8,10,12-16,23-26H,4-6H2,1-3H3/t8-,10+,12?,13+,14?,15+,16-,19+,20+,21+/m0/s1
PCBioAssay
n/an/a 6.42E+3n/an/an/an/an/an/a
Emory University Molecular Libraries Screening Center
Curated by PubChem BioAssay
Assay Description
NIH Molecular Libraries Screening Centers Network [MLSCN] Emory Chemical Biology Discovery Center in MLSCN Assay provider: Dr. Randal Kaufman, Univer...
PubChem Bioassay (2011)
BindingDB Entry DOI: 10.7270/Q2NK3CGB
DNA damage-inducible transcript 3 protein
(Mus musculus)
BDBM63866
(Bruceolide | MLS000728513 | SMR000445627 | cid_167...)
Show SMILES [H][C@]12[C@@H](O)C(=O)O[C@]3([H])C[C@@]4([H])C(C)=C(O)C(=O)C[C@@]4(C)C4C(O)[C@H](O)[C@@]1(OC[C@@]234)C(=O)OC |t:13|
Show InChI InChI=1S/C21H26O10/c1-7-8-4-10-20-6-30-21(18(28)29-3,15(20)13(25)17(27)31-10)16(26)12(24)14(20)19(8,2)5-9(22)11(7)23/h8,10,12-16,23-26H,4-6H2,1-3H3/t8-,10+,12?,13+,14?,15+,16-,19+,20+,21+/m0/s1
PCBioAssay
n/an/a<160n/an/an/an/an/an/a
Emory University Molecular Libraries Screening Center
Curated by PubChem BioAssay
Assay Description
NIH Molecular Libraries Screening Centers Network [MLSCN] Emory Chemical Biology Discovery Center in MLSCN Assay provider: Dr. Randal Kaufman, Univer...
PubChem Bioassay (2011)
BindingDB Entry DOI: 10.7270/Q28C9TQN
DNA damage-inducible transcript 3 protein
(Mus musculus)
BDBM63866
(Bruceolide | MLS000728513 | SMR000445627 | cid_167...)
Show SMILES [H][C@]12[C@@H](O)C(=O)O[C@]3([H])C[C@@]4([H])C(C)=C(O)C(=O)C[C@@]4(C)C4C(O)[C@H](O)[C@@]1(OC[C@@]234)C(=O)OC |t:13|
Show InChI InChI=1S/C21H26O10/c1-7-8-4-10-20-6-30-21(18(28)29-3,15(20)13(25)17(27)31-10)16(26)12(24)14(20)19(8,2)5-9(22)11(7)23/h8,10,12-16,23-26H,4-6H2,1-3H3/t8-,10+,12?,13+,14?,15+,16-,19+,20+,21+/m0/s1
PCBioAssay
n/an/a<160n/an/an/an/an/an/a
Emory University Molecular Libraries Screening Center
Curated by PubChem BioAssay
Assay Description
NIH Molecular Libraries Screening Centers Network [MLSCN] Emory Chemical Biology Discovery Center in MLSCN Assay provider: Dr. Randal Kaufman, Univer...
PubChem Bioassay (2010)
BindingDB Entry DOI: 10.7270/Q2PC30VZ