BDBM6389 3-[(5-{6-[(3-methoxyphenyl)amino]pyrazin-2-yl}pyridin-3-yl)amino]propan-1-ol::3-[[5-[6-[(3-Methoxyphenyl)amino]pyrazinyl]-3-pyridinyl]-1-propanol::Pyrazine-Pyridine Biheteroaryl 15
SMILES: COc1cccc(Nc2cncc(n2)-c2cncc(NCCCO)c2)c1
InChI Key: InChIKey=TYOTYOPLSRQPGK-UHFFFAOYSA-N
Data: 2 IC50
Activity Spreadsheet -- Enzyme Inhibition Constant Data from BindingDB
Found 2 hits for monomerid = 6389
Trg + Lig
Ki
nM
ΔG°
kcal/mole
IC50
nM
Kd
nM
EC50/IC50
nM
koff
s-1
kon
M-1s-1
pHTemp
°C
VEGFR-2 (KDR)
(Rattus norvegicus (rat))
BDBM6389
(3-[(5-{6-[(3-methoxyphenyl)amino]pyrazin-2-yl}pyri...)
Show SMILES COc1cccc(Nc2cncc(n2)-c2cncc(NCCCO)c2)c1
Show InChI InChI=1S/C19H21N5O2/c1-26-17-5-2-4-15(9-17)23-19-13-21-12-18(24-19)14-8-16(11-20-10-14)22-6-3-7-25/h2,4-5,8-13,22,25H,3,6-7H2,1H3,(H,23,24)
n/an/a 740n/an/an/an/a8.030
Johnson & Johnson Pharmaceutical
Assay Description
The enzyme was assayed with a biotinylated peptide substrate and test compounds in the presence of 5 uM ATP/[gamma-33P]ATP in a streptavidin coated F...
J Med Chem 48: 4892-909 (2005)
Article DOI: 10.1021/jm058205b
BindingDB Entry DOI: 10.7270/Q2NC5ZD5
Cyclin-Dependent Kinase 1 (CDK1)
(Homo sapiens (Human))
BDBM6389
(3-[(5-{6-[(3-methoxyphenyl)amino]pyrazin-2-yl}pyri...)
Show SMILES COc1cccc(Nc2cncc(n2)-c2cncc(NCCCO)c2)c1
Show InChI InChI=1S/C19H21N5O2/c1-26-17-5-2-4-15(9-17)23-19-13-21-12-18(24-19)14-8-16(11-20-10-14)22-6-3-7-25/h2,4-5,8-13,22,25H,3,6-7H2,1H3,(H,23,24)
Reactome pathway
n/an/a>1.00E+4n/an/an/an/a8.030
Johnson & Johnson Pharmaceutical
Assay Description
The enzyme was assayed with a biotinylated peptide substrate and test compounds in the presence of 5 uM ATP/[gamma-33P]ATP in a streptavidin coated F...
J Med Chem 48: 4892-909 (2005)
Article DOI: 10.1021/jm058205b
BindingDB Entry DOI: 10.7270/Q2NC5ZD5