BDBM6391 (3-Chloro-phenyl)-{6-[5-(3-pyridin-4-yl-propylamino)-pyridin-3-yl]-pyrazin-2-yl}-amine::N-(3-chlorophenyl)-6-(5-{[3-(pyridin-4-yl)propyl]amino}pyridin-3-yl)pyrazin-2-amine::Pyrazine-Pyridine Biheteroaryl 20
SMILES: Clc1cccc(Nc2cncc(n2)-c2cncc(NCCCc3ccncc3)c2)c1
InChI Key: InChIKey=WYCDDSZFBQZASO-UHFFFAOYSA-N
Data: 2 IC50
Activity Spreadsheet -- Enzyme Inhibition Constant Data from BindingDB
Found 2 hits for monomerid = 6391
Trg + Lig
Ki
nM
ΔG°
kcal/mole
IC50
nM
Kd
nM
EC50/IC50
nM
koff
s-1
kon
M-1s-1
pHTemp
°C
VEGFR-2 (KDR)
(Rattus norvegicus (rat))
BDBM6391
((3-Chloro-phenyl)-{6-[5-(3-pyridin-4-yl-propylamin...)
Show SMILES Clc1cccc(Nc2cncc(n2)-c2cncc(NCCCc3ccncc3)c2)c1
Show InChI InChI=1S/C23H21ClN6/c24-19-4-1-5-20(12-19)29-23-16-27-15-22(30-23)18-11-21(14-26-13-18)28-8-2-3-17-6-9-25-10-7-17/h1,4-7,9-16,28H,2-3,8H2,(H,29,30)
n/an/a 76n/an/an/an/a8.030
Johnson & Johnson Pharmaceutical
Assay Description
The enzyme was assayed with a biotinylated peptide substrate and test compounds in the presence of 5 uM ATP/[gamma-33P]ATP in a streptavidin coated F...
J Med Chem 48: 4892-909 (2005)
Article DOI: 10.1021/jm058205b
BindingDB Entry DOI: 10.7270/Q2NC5ZD5
Cyclin-Dependent Kinase 1 (CDK1)
(Homo sapiens (Human))
BDBM6391
((3-Chloro-phenyl)-{6-[5-(3-pyridin-4-yl-propylamin...)
Show SMILES Clc1cccc(Nc2cncc(n2)-c2cncc(NCCCc3ccncc3)c2)c1
Show InChI InChI=1S/C23H21ClN6/c24-19-4-1-5-20(12-19)29-23-16-27-15-22(30-23)18-11-21(14-26-13-18)28-8-2-3-17-6-9-25-10-7-17/h1,4-7,9-16,28H,2-3,8H2,(H,29,30)
Reactome pathway
n/an/a>1.00E+4n/an/an/an/a8.030
Johnson & Johnson Pharmaceutical
Assay Description
The enzyme was assayed with a biotinylated peptide substrate and test compounds in the presence of 5 uM ATP/[gamma-33P]ATP in a streptavidin coated F...
J Med Chem 48: 4892-909 (2005)
Article DOI: 10.1021/jm058205b
BindingDB Entry DOI: 10.7270/Q2NC5ZD5