BDBM6412 N-(3-Chlorophenyl)-6-[5-[[4-(4-pyridinyl)butyl]amino]-3-pyridinyl]-2-pyrazinamine::N-(3-chlorophenyl)-6-(5-{[4-(pyridin-4-yl)butyl]amino}pyridin-3-yl)pyrazin-2-amine::Pyrazine-Pyridine Biheteroaryl 55
SMILES: Clc1cccc(Nc2cncc(n2)-c2cncc(NCCCCc3ccncc3)c2)c1
InChI Key: InChIKey=BQEIJKOXORSBIM-UHFFFAOYSA-N
Data: 2 IC50
Activity Spreadsheet -- Enzyme Inhibition Constant Data from BindingDB
Found 2 hits for monomerid = 6412
Trg + Lig
Ki
nM
ΔG°
kcal/mole
IC50
nM
Kd
nM
EC50/IC50
nM
koff
s-1
kon
M-1s-1
pHTemp
°C
VEGFR-2 (KDR)
(Rattus norvegicus (rat))
BDBM6412
(N-(3-Chlorophenyl)-6-[5-[[4-(4-pyridinyl)butyl]ami...)
Show SMILES Clc1cccc(Nc2cncc(n2)-c2cncc(NCCCCc3ccncc3)c2)c1
Show InChI InChI=1S/C24H23ClN6/c25-20-5-3-6-21(13-20)30-24-17-28-16-23(31-24)19-12-22(15-27-14-19)29-9-2-1-4-18-7-10-26-11-8-18/h3,5-8,10-17,29H,1-2,4,9H2,(H,30,31)
n/an/a 266n/an/an/an/an/an/a
Johnson & Johnson Pharmaceutical
Assay Description
The enzyme was assayed with a biotinylated peptide substrate and test compounds in the presence of 5 uM ATP/[gamma-33P]ATP in a streptavidin coated F...
J Med Chem 48: 4892-909 (2005)
Article DOI: 10.1021/jm058205b
BindingDB Entry DOI: 10.7270/Q2NC5ZD5
Cyclin-Dependent Kinase 1 (CDK1)
(Homo sapiens (Human))
BDBM6412
(N-(3-Chlorophenyl)-6-[5-[[4-(4-pyridinyl)butyl]ami...)
Show SMILES Clc1cccc(Nc2cncc(n2)-c2cncc(NCCCCc3ccncc3)c2)c1
Show InChI InChI=1S/C24H23ClN6/c25-20-5-3-6-21(13-20)30-24-17-28-16-23(31-24)19-12-22(15-27-14-19)29-9-2-1-4-18-7-10-26-11-8-18/h3,5-8,10-17,29H,1-2,4,9H2,(H,30,31)
Reactome pathway
n/an/a 1.00E+4n/an/an/an/an/an/a
Johnson & Johnson Pharmaceutical
Assay Description
The enzyme was assayed with a biotinylated peptide substrate and test compounds in the presence of 5 uM ATP/[gamma-33P]ATP in a streptavidin coated F...
J Med Chem 48: 4892-909 (2005)
Article DOI: 10.1021/jm058205b
BindingDB Entry DOI: 10.7270/Q2NC5ZD5