BDBM6421 N-(3-Chlorophenyl)-6-[5-[[3-(1H-1,2,4-triazol-1-yl)propyl]amino]-3-pyridinyl]-2-pyrazinamine::N-(3-chlorophenyl)-6-(5-{[3-(1H-1,2,4-triazol-1-yl)propyl]amino}pyridin-3-yl)pyrazin-2-amine::Pyrazine-Pyridine Biheteroaryl 58
SMILES: Clc1cccc(Nc2cncc(n2)-c2cncc(NCCCn3cncn3)c2)c1
InChI Key: InChIKey=QGAMKOCDVQJIEP-UHFFFAOYSA-N
Data: 5 IC50
Activity Spreadsheet -- Enzyme Inhibition Constant Data from BindingDB
Found 5 hits for monomerid = 6421
Trg + Lig
Ki
nM
ΔG°
kcal/mole
IC50
nM
Kd
nM
EC50/IC50
nM
koff
s-1
kon
M-1s-1
pHTemp
°C
Cyclin-Dependent Kinase 1 (CDK1)
(Homo sapiens (Human))
BDBM6421
(N-(3-Chlorophenyl)-6-[5-[[3-(1H-1,2,4-triazol-1-yl...)
Show SMILES Clc1cccc(Nc2cncc(n2)-c2cncc(NCCCn3cncn3)c2)c1
Show InChI InChI=1S/C20H19ClN8/c21-16-3-1-4-17(8-16)27-20-12-23-11-19(28-20)15-7-18(10-22-9-15)25-5-2-6-29-14-24-13-26-29/h1,3-4,7-14,25H,2,5-6H2,(H,27,28)
Reactome pathway
n/an/a>1.00E+4n/an/an/an/an/an/a
Johnson & Johnson Pharmaceutical
Assay Description
The enzyme was assayed with a biotinylated peptide substrate and test compounds in the presence of 5 uM ATP/[gamma-33P]ATP in a streptavidin coated F...
J Med Chem 48: 4892-909 (2005)
Article DOI: 10.1021/jm058205b
BindingDB Entry DOI: 10.7270/Q2NC5ZD5
Vascular endothelial growth factor receptor 2
(Rattus norvegicus (rat))
BDBM6421
(N-(3-Chlorophenyl)-6-[5-[[3-(1H-1,2,4-triazol-1-yl...)
Show SMILES Clc1cccc(Nc2cncc(n2)-c2cncc(NCCCn3cncn3)c2)c1
Show InChI InChI=1S/C20H19ClN8/c21-16-3-1-4-17(8-16)27-20-12-23-11-19(28-20)15-7-18(10-22-9-15)25-5-2-6-29-14-24-13-26-29/h1,3-4,7-14,25H,2,5-6H2,(H,27,28)
n/an/a 67n/an/an/an/an/an/a
Johnson & Johnson Pharmaceutical
Assay Description
The enzyme was assayed with a biotinylated peptide substrate and test compounds in the presence of 5 uM ATP/[gamma-33P]ATP in a streptavidin coated F...
J Med Chem 48: 4892-909 (2005)
Article DOI: 10.1021/jm058205b
BindingDB Entry DOI: 10.7270/Q2NC5ZD5
Fibroblast growth factor receptor 2
(Homo sapiens (Human))
BDBM6421
(N-(3-Chlorophenyl)-6-[5-[[3-(1H-1,2,4-triazol-1-yl...)
Show SMILES Clc1cccc(Nc2cncc(n2)-c2cncc(NCCCn3cncn3)c2)c1
Show InChI InChI=1S/C20H19ClN8/c21-16-3-1-4-17(8-16)27-20-12-23-11-19(28-20)15-7-18(10-22-9-15)25-5-2-6-29-14-24-13-26-29/h1,3-4,7-14,25H,2,5-6H2,(H,27,28)
NCI pathway
Reactome pathway
n/an/a 153n/an/an/an/an/an/a
Johnson & Johnson Pharmaceutical
Assay Description
The enzyme was assayed with a biotinylated peptide substrate and test compounds in the presence of 5 uM ATP/[gamma-33P]ATP in a streptavidin coated F...
J Med Chem 48: 4892-909 (2005)
Article DOI: 10.1021/jm058205b
BindingDB Entry DOI: 10.7270/Q2NC5ZD5
Glycogen synthase kinase-3 beta [7-25]
(Oryctolagus cuniculus (rabbit))
BDBM6421
(N-(3-Chlorophenyl)-6-[5-[[3-(1H-1,2,4-triazol-1-yl...)
Show SMILES Clc1cccc(Nc2cncc(n2)-c2cncc(NCCCn3cncn3)c2)c1
Show InChI InChI=1S/C20H19ClN8/c21-16-3-1-4-17(8-16)27-20-12-23-11-19(28-20)15-7-18(10-22-9-15)25-5-2-6-29-14-24-13-26-29/h1,3-4,7-14,25H,2,5-6H2,(H,27,28)
n/an/a 196n/an/an/an/an/an/a
Johnson & Johnson Pharmaceutical
Assay Description
The enzyme was assayed with a biotinylated peptide substrate and test compounds in the presence of 5 uM ATP/[gamma-33P]ATP in a streptavidin coated F...
J Med Chem 48: 4892-909 (2005)
Article DOI: 10.1021/jm058205b
BindingDB Entry DOI: 10.7270/Q2NC5ZD5
Platelet-derived growth factor receptor beta
(Homo sapiens (Human))
BDBM6421
(N-(3-Chlorophenyl)-6-[5-[[3-(1H-1,2,4-triazol-1-yl...)
Show SMILES Clc1cccc(Nc2cncc(n2)-c2cncc(NCCCn3cncn3)c2)c1
Show InChI InChI=1S/C20H19ClN8/c21-16-3-1-4-17(8-16)27-20-12-23-11-19(28-20)15-7-18(10-22-9-15)25-5-2-6-29-14-24-13-26-29/h1,3-4,7-14,25H,2,5-6H2,(H,27,28)
NCI pathway
Reactome pathway
n/an/a 725n/an/an/an/an/an/a
Johnson & Johnson Pharmaceutical
Assay Description
The enzyme was assayed with a biotinylated peptide substrate and test compounds in the presence of 5 uM ATP/[gamma-33P]ATP in a streptavidin coated F...
J Med Chem 48: 4892-909 (2005)
Article DOI: 10.1021/jm058205b
BindingDB Entry DOI: 10.7270/Q2NC5ZD5