BDBM6435 3-[(6-{6-[(3-chlorophenyl)amino]pyrazin-2-yl}pyridin-3-yl)amino]propan-1-ol::3-{[6-[6-((3-Chlorophenyl)amino)pyrazin-2-yl]pyridin-3-yl]amino}propan-1-ol::Pyrazine-Pyridine deriv. 55
SMILES: OCCCNc1ccc(nc1)-c1cncc(Nc2cccc(Cl)c2)n1
InChI Key: InChIKey=XJKHFVURJJPEDE-UHFFFAOYSA-N
Data: 2 IC50
Activity Spreadsheet -- Enzyme Inhibition Constant Data from BindingDB
Found 2 hits for monomerid = 6435
Trg + Lig
Ki
nM
ΔG°
kcal/mole
IC50
nM
Kd
nM
EC50/IC50
nM
koff
s-1
kon
M-1s-1
pHTemp
°C
VEGFR-2 (KDR)
(Rattus norvegicus (rat))
BDBM6435
(3-[(6-{6-[(3-chlorophenyl)amino]pyrazin-2-yl}pyrid...)
Show SMILES OCCCNc1ccc(nc1)-c1cncc(Nc2cccc(Cl)c2)n1
Show InChI InChI=1S/C18H18ClN5O/c19-13-3-1-4-14(9-13)23-18-12-20-11-17(24-18)16-6-5-15(10-22-16)21-7-2-8-25/h1,3-6,9-12,21,25H,2,7-8H2,(H,23,24)
n/an/a>1.00E+4n/an/an/an/an/an/a
Johnson & Johnson Pharmaceutical
Assay Description
The enzyme was assayed with a biotinylated peptide substrate and test compounds in the presence of 5 uM ATP/[gamma-33P]ATP in a streptavidin coated F...
J Med Chem 48: 1886-900 (2005)
Article DOI: 10.1021/jm040099a
BindingDB Entry DOI: 10.7270/Q2HM56NC
Cyclin-Dependent Kinase 1 (CDK1)
(Homo sapiens (Human))
BDBM6435
(3-[(6-{6-[(3-chlorophenyl)amino]pyrazin-2-yl}pyrid...)
Show SMILES OCCCNc1ccc(nc1)-c1cncc(Nc2cccc(Cl)c2)n1
Show InChI InChI=1S/C18H18ClN5O/c19-13-3-1-4-14(9-13)23-18-12-20-11-17(24-18)16-6-5-15(10-22-16)21-7-2-8-25/h1,3-6,9-12,21,25H,2,7-8H2,(H,23,24)
Reactome pathway
n/an/a>1.00E+4n/an/an/an/a8.030
Johnson & Johnson Pharmaceutical
Assay Description
The enzyme was assayed with a biotinylated peptide substrate and test compounds in the presence of 5 uM ATP/[gamma-33P]ATP in a streptavidin coated F...
J Med Chem 48: 1886-900 (2005)
Article DOI: 10.1021/jm040099a
BindingDB Entry DOI: 10.7270/Q2HM56NC