BDBM64503 2-(2-chloranyl-4-fluoranyl-phenoxy)-N-(4-pyridin-2-yl-1,3-thiazol-2-yl)ethanamide::2-(2-chloro-4-fluoro-phenoxy)-N-[4-(2-pyridyl)thiazol-2-yl]acetamide::2-(2-chloro-4-fluorophenoxy)-N-(4-pyridin-2-yl-1,3-thiazol-2-yl)acetamide::2-(2-chloro-4-fluorophenoxy)-N-[4-(2-pyridinyl)-2-thiazolyl]acetamide::MLS001161489::SMR000716422::cid_16285260
SMILES: Fc1ccc(OCC(=O)Nc2nc(cs2)-c2ccccn2)c(Cl)c1
InChI Key: InChIKey=JMHHGCDXBKQDBP-UHFFFAOYSA-N
Data: 2 EC50
Activity Spreadsheet -- Enzyme Inhibition Constant Data from BindingDB
Found 2 hits for monomerid = 64503
Trg + Lig
Ki
nM
ΔG°
kcal/mole
IC50
nM
Kd
nM
EC50/IC50
nM
koff
s-1
kon
M-1s-1
pHTemp
°C
Vacuolar aminopeptidase 1
(Saccharomyces cerevisiae)
BDBM64503
(2-(2-chloranyl-4-fluoranyl-phenoxy)-N-(4-pyridin-2...)
Show SMILES Fc1ccc(OCC(=O)Nc2nc(cs2)-c2ccccn2)c(Cl)c1
Show InChI InChI=1S/C16H11ClFN3O2S/c17-11-7-10(18)4-5-14(11)23-8-15(22)21-16-20-13(9-24-16)12-3-1-2-6-19-12/h1-7,9H,8H2,(H,20,21,22)
PCBioAssay
n/an/an/an/a 2.98E+3n/an/an/an/a
NMMLSC
Curated by PubChem BioAssay
Assay Description
University of New Mexico Assay Overview: Assay Support: 1R03 MH086450-01 Project Title: Chemical Screen of TOR pathway GFP fusion proteins in S. ...
PubChem Bioassay (2010)
BindingDB Entry DOI: 10.7270/Q21R6P02
Heat shock factor protein 1
(Mus musculus)
BDBM64503
(2-(2-chloranyl-4-fluoranyl-phenoxy)-N-(4-pyridin-2...)
Show SMILES Fc1ccc(OCC(=O)Nc2nc(cs2)-c2ccccn2)c(Cl)c1
Show InChI InChI=1S/C16H11ClFN3O2S/c17-11-7-10(18)4-5-14(11)23-8-15(22)21-16-20-13(9-24-16)12-3-1-2-6-19-12/h1-7,9H,8H2,(H,20,21,22)
PCBioAssay
n/an/an/an/a 4.14E+4n/an/an/an/a
Broad Institute
Curated by PubChem BioAssay
Assay Description
Keywords: Heat Shock Factor-1 (HSF-1), Stress Response, MG132, NIH3T3, Luminescence Assay Overview: Modified NIH3T3, transformed to express firefly...
PubChem Bioassay (2010)
BindingDB Entry DOI: 10.7270/Q2MW2FKX