null
SMILES: COc1cccc(C=NNC(=O)C(=O)Nc2ccccc2OC(F)(F)C(F)F)c1O
InChI Key: InChIKey=SPYQUUZBXVDPJN-UHFFFAOYSA-N
Activity Spreadsheet -- Enzyme Inhibition Constant Data from BindingDB
Found 2 hits for monomerid = 64618
Trg + Lig
Ki
nM
ΔG°
kcal/mole
IC50
nM
Kd
nM
EC50/IC50
nM
koff
s-1
kon
M-1s-1
pHTemp
°C
Nuclear receptor coactivator 1
(Homo sapiens (Human))
BDBM64618
(2-[(2E)-2-(2-hydroxy-3-methoxybenzylidene)hydrazin...)
Show SMILES COc1cccc(C=NNC(=O)C(=O)Nc2ccccc2OC(F)(F)C(F)F)c1O |w:8.8|
Show InChI InChI=1S/C18H15F4N3O5/c1-29-13-8-4-5-10(14(13)26)9-23-25-16(28)15(27)24-11-6-2-3-7-12(11)30-18(21,22)17(19)20/h2-9,17,26H,1H3,(H,24,27)(H,25,28)
Reactome pathway
PCBioAssay
n/an/a 5.69E+3n/an/an/an/an/an/a
The Scripps Research Institute Molecular Screening Center
Curated by PubChem BioAssay
Assay Description
Source (MLPCN Center Name): The Scripps Research Institute Molecular Screening Center (SRIMSC) Affiliation: The Scripps Research Institute, TSRI Assa...
PubChem Bioassay (2012)
BindingDB Entry DOI: 10.7270/Q2794387
Nuclear receptor coactivator 3
(Homo sapiens (Human))
BDBM64618
(2-[(2E)-2-(2-hydroxy-3-methoxybenzylidene)hydrazin...)
Show SMILES COc1cccc(C=NNC(=O)C(=O)Nc2ccccc2OC(F)(F)C(F)F)c1O |w:8.8|
Show InChI InChI=1S/C18H15F4N3O5/c1-29-13-8-4-5-10(14(13)26)9-23-25-16(28)15(27)24-11-6-2-3-7-12(11)30-18(21,22)17(19)20/h2-9,17,26H,1H3,(H,24,27)(H,25,28)
Reactome pathway
PCBioAssay
n/an/a 5.65E+3n/an/an/an/an/an/a
The Scripps Research Institute Molecular Screening Center
Curated by PubChem BioAssay
Assay Description
Source (MLPCN Center Name): The Scripps Research Institute Molecular Screening Center (SRIMSC) Affiliation: The Scripps Research Institute, TSRI Assa...
PubChem Bioassay (2012)
BindingDB Entry DOI: 10.7270/Q2C24V0K