BDBM6464 4-Anilino-7,8-dialkoxybenzo[g]quinoline-3-carbonitrile 16e::4-[(2,4-dichloro-5-methoxyphenyl)amino]-7-[2-(4-hydroxypiperidin-1-yl)ethoxy]-8-methoxybenzo[g]quinoline-3-carbonitrile
SMILES: COc1cc(Nc2c(cnc3cc4cc(OC)c(OCCN5CCC(O)CC5)cc4cc23)C#N)c(Cl)cc1Cl
InChI Key: InChIKey=SHXDIAJEJCIDRW-UHFFFAOYSA-N
Data: 1 IC50
Activity Spreadsheet -- Enzyme Inhibition Constant Data from BindingDB
Found 1 hit for monomerid = 6464
Trg + Lig
Ki
nM
ΔG°
kcal/mole
IC50
nM
Kd
nM
EC50/IC50
nM
koff
s-1
kon
M-1s-1
pHTemp
°C
Proto-oncogene tyrosine-protein kinase Src
(Homo sapiens (Human))
BDBM6464
(4-Anilino-7,8-dialkoxybenzo[g]quinoline-3-carbonit...)
Show SMILES COc1cc(Nc2c(cnc3cc4cc(OC)c(OCCN5CCC(O)CC5)cc4cc23)C#N)c(Cl)cc1Cl
Show InChI InChI=1S/C29H28Cl2N4O4/c1-37-26-14-25(22(30)13-23(26)31)34-29-19(15-32)16-33-24-10-18-11-27(38-2)28(12-17(18)9-21(24)29)39-8-7-35-5-3-20(36)4-6-35/h9-14,16,20,36H,3-8H2,1-2H3,(H,33,34)
n/an/a 2.10n/an/an/an/a7.530
Wyeth Research
Assay Description
Src kinase activity was measured in an ELISA format. IC50 is the inhibitor concentration which inhibits 50% of kinase activity that catalyzes the tra...
J Med Chem 48: 5909-20 (2005)
Article DOI: 10.1021/jm050512u
BindingDB Entry DOI: 10.7270/Q2833Q6N