BDBM6465 4-Anilino-7,8-dialkoxybenzo[g]quinoline-3-carbonitrile 16f::4-[(2-chloro-5-methoxy-4-methylphenyl)amino]-8-methoxy-7-[2-(morpholin-4-yl)ethoxy]benzo[g]quinoline-3-carbonitrile
SMILES: COc1cc(Nc2c(cnc3cc4cc(OC)c(OCCN5CCOCC5)cc4cc23)C#N)c(Cl)cc1C
InChI Key: InChIKey=OJWZDVSAGBWGLF-UHFFFAOYSA-N
Data: 1 IC50
Activity Spreadsheet -- Enzyme Inhibition Constant Data from BindingDB
Found 1 hit for monomerid = 6465
Trg + Lig
Ki
nM
ΔG°
kcal/mole
IC50
nM
Kd
nM
EC50/IC50
nM
koff
s-1
kon
M-1s-1
pHTemp
°C
Proto-oncogene tyrosine-protein kinase Src
(Homo sapiens (Human))
BDBM6465
(4-Anilino-7,8-dialkoxybenzo[g]quinoline-3-carbonit...)
Show SMILES COc1cc(Nc2c(cnc3cc4cc(OC)c(OCCN5CCOCC5)cc4cc23)C#N)c(Cl)cc1C
Show InChI InChI=1S/C29H29ClN4O4/c1-18-10-23(30)25(15-26(18)35-2)33-29-21(16-31)17-32-24-12-20-13-27(36-3)28(14-19(20)11-22(24)29)38-9-6-34-4-7-37-8-5-34/h10-15,17H,4-9H2,1-3H3,(H,32,33)
n/an/a 2.5n/an/an/an/a7.530
Wyeth Research
Assay Description
Src kinase activity was measured in an ELISA format. IC50 is the inhibitor concentration which inhibits 50% of kinase activity that catalyzes the tra...
J Med Chem 48: 5909-20 (2005)
Article DOI: 10.1021/jm050512u
BindingDB Entry DOI: 10.7270/Q2833Q6N