BDBM6470 4-Anilino-7,8-dialkoxybenzo[g]quinoline-3-carbonitrile 17b::4-[(4-chloro-5-methoxy-2-methylphenyl)amino]-7-methoxy-8-[2-(4-methylpiperazin-1-yl)ethoxy]benzo[g]quinoline-3-carbonitrile
SMILES: COc1cc(Nc2c(cnc3cc4cc(OCCN5CCN(C)CC5)c(OC)cc4cc23)C#N)c(C)cc1Cl
InChI Key: InChIKey=FGKLQUDQGKTRSU-UHFFFAOYSA-N
Data: 1 IC50
Activity Spreadsheet -- Enzyme Inhibition Constant Data from BindingDB
Found 1 hit for monomerid = 6470
Trg + Lig
Ki
nM
ΔG°
kcal/mole
IC50
nM
Kd
nM
EC50/IC50
nM
koff
s-1
kon
M-1s-1
pHTemp
°C
Proto-oncogene tyrosine-protein kinase Src
(Homo sapiens (Human))
BDBM6470
(4-Anilino-7,8-dialkoxybenzo[g]quinoline-3-carbonit...)
Show SMILES COc1cc(Nc2c(cnc3cc4cc(OCCN5CCN(C)CC5)c(OC)cc4cc23)C#N)c(C)cc1Cl
Show InChI InChI=1S/C30H32ClN5O3/c1-19-11-24(31)27(37-3)16-25(19)34-30-22(17-32)18-33-26-13-21-15-29(28(38-4)14-20(21)12-23(26)30)39-10-9-36-7-5-35(2)6-8-36/h11-16,18H,5-10H2,1-4H3,(H,33,34)
n/an/a 0.310n/an/an/an/a7.530
Wyeth Research
Assay Description
Src kinase activity was measured in an ELISA format. IC50 is the inhibitor concentration which inhibits 50% of kinase activity that catalyzes the tra...
J Med Chem 48: 5909-20 (2005)
Article DOI: 10.1021/jm050512u
BindingDB Entry DOI: 10.7270/Q2833Q6N