BDBM6471 4-Anilino-7,8-dialkoxybenzo[g]quinoline-3-carbonitrile 17c::4-[(2,4-dichloro-5-methoxyphenyl)amino]-7-methoxy-8-[2-(morpholin-4-yl)ethoxy]benzo[g]quinoline-3-carbonitrile
SMILES: COc1cc(Nc2c(cnc3cc4cc(OCCN5CCOCC5)c(OC)cc4cc23)C#N)c(Cl)cc1Cl
InChI Key: InChIKey=UNZHPVUBBKLAJR-UHFFFAOYSA-N
Data: 2 IC50
Activity Spreadsheet -- Enzyme Inhibition Constant Data from BindingDB
Found 2 hits for monomerid = 6471
Trg + Lig
Ki
nM
ΔG°
kcal/mole
IC50
nM
Kd
nM
EC50/IC50
nM
koff
s-1
kon
M-1s-1
pHTemp
°C
Proto-oncogene tyrosine-protein kinase Src
(Homo sapiens (Human))
BDBM6471
(4-Anilino-7,8-dialkoxybenzo[g]quinoline-3-carbonit...)
Show SMILES COc1cc(Nc2c(cnc3cc4cc(OCCN5CCOCC5)c(OC)cc4cc23)C#N)c(Cl)cc1Cl
Show InChI InChI=1S/C28H26Cl2N4O4/c1-35-25-14-24(21(29)13-22(25)30)33-28-19(15-31)16-32-23-10-18-12-27(26(36-2)11-17(18)9-20(23)28)38-8-5-34-3-6-37-7-4-34/h9-14,16H,3-8H2,1-2H3,(H,32,33)
n/an/a 0.460n/an/an/an/an/an/a
Institut de Recherches Servier
Curated by ChEMBL
Assay Description
Inhibition of c-SRC
Bioorg Med Chem 19: 2517-28 (2011)
Article DOI: 10.1016/j.bmc.2011.03.021
BindingDB Entry DOI: 10.7270/Q2DN45CD
Proto-oncogene tyrosine-protein kinase Src
(Homo sapiens (Human))
BDBM6471
(4-Anilino-7,8-dialkoxybenzo[g]quinoline-3-carbonit...)
Show SMILES COc1cc(Nc2c(cnc3cc4cc(OCCN5CCOCC5)c(OC)cc4cc23)C#N)c(Cl)cc1Cl
Show InChI InChI=1S/C28H26Cl2N4O4/c1-35-25-14-24(21(29)13-22(25)30)33-28-19(15-31)16-32-23-10-18-12-27(26(36-2)11-17(18)9-20(23)28)38-8-5-34-3-6-37-7-4-34/h9-14,16H,3-8H2,1-2H3,(H,32,33)
n/an/a 0.460n/an/an/an/a7.530
Wyeth Research
Assay Description
Src kinase activity was measured in an ELISA format. IC50 is the inhibitor concentration which inhibits 50% of kinase activity that catalyzes the tra...
J Med Chem 48: 5909-20 (2005)
Article DOI: 10.1021/jm050512u
BindingDB Entry DOI: 10.7270/Q2833Q6N