null
SMILES: CC1CCCN(C1)C(c1sc2nc(C)nn2c1O)c1cccc(F)c1
InChI Key: InChIKey=MSZYVBDUAHETNH-UHFFFAOYSA-N
Activity Spreadsheet -- Enzyme Inhibition Constant Data from BindingDB
Found 1 hit for monomerid = 64934
Trg + Lig
Ki
nM
ΔG°
kcal/mole
IC50
nM
Kd
nM
EC50/IC50
nM
koff
s-1
kon
M-1s-1
pHTemp
°C
ATP-dependent molecular chaperone HSP82
(Candida albicans)
BDBM64934
(5-[(3-fluorophenyl)(3-methylpiperidin-1-yl)methyl]...)
Show SMILES CC1CCCN(C1)C(c1sc2nc(C)nn2c1O)c1cccc(F)c1
Show InChI InChI=1S/C18H21FN4OS/c1-11-5-4-8-22(10-11)15(13-6-3-7-14(19)9-13)16-17(24)23-18(25-16)20-12(2)21-23/h3,6-7,9,11,15,24H,4-5,8,10H2,1-2H3
PCBioAssay
n/an/an/an/a 798n/an/an/an/a
Broad Institute
Curated by PubChem BioAssay
Assay Description
Broad Institute: Reversing Antifungal Drug Resistance Project ID: 2037 Keywords: Candida albicans, drug resistance, Fluconazole, Hsp90, Calcineurin, ...
PubChem Bioassay (2010)
BindingDB Entry DOI: 10.7270/Q26M358G