BDBM65170 US10166249, Example 519::US9522888, 519
SMILES: CC(C)(C)CCSC[C@@H]1CCc2cc(ccc2C1)[C@H]1CC[C@](N)(COP(O)(O)=O)C1
InChI Key: InChIKey=BSFYXTQGXCTSDB-FRGLQRNOSA-N
Data: 2 IC50  6 EC50
Activity Spreadsheet -- Enzyme Inhibition Constant Data from BindingDB
Found 8 hits for monomerid = 65170
Trg + Lig
Ki
nM
ΔG°
kcal/mole
IC50
nM
Kd
nM
EC50/IC50
nM
koff
s-1
kon
M-1s-1
pHTemp
°C
Sphingosine 1-phosphate receptor 1
(Homo sapiens (Human))
BDBM65170
(US10166249, Example 519 | US9522888, 519)
Show SMILES CC(C)(C)CCSC[C@@H]1CCc2cc(ccc2C1)[C@H]1CC[C@](N)(COP(O)(O)=O)C1 |r|
Show InChI InChI=1S/C23H38NO4PS/c1-22(2,3)10-11-30-15-17-4-5-19-13-20(7-6-18(19)12-17)21-8-9-23(24,14-21)16-28-29(25,26)27/h6-7,13,17,21H,4-5,8-12,14-16,24H2,1-3H3,(H2,25,26,27)/t17-,21+,23-/m1/s1
Reactome pathway
US Patent
n/an/a<10n/an/an/an/a7.525
Bristol-Myers Squibb Company
US Patent
Assay Description
Membranes were prepared from CHO cells expressing human S1P1. Cells pellets (1x10^9 cells/pellet) were suspended in buffer containing 20 mM HEPES (4-...
US Patent US9522888 (2016)
BindingDB Entry DOI: 10.7270/Q20K27HV
Sphingosine 1-phosphate receptor 1
(Homo sapiens (Human))
BDBM65170
(US10166249, Example 519 | US9522888, 519)
Show SMILES CC(C)(C)CCSC[C@@H]1CCc2cc(ccc2C1)[C@H]1CC[C@](N)(COP(O)(O)=O)C1 |r|
Show InChI InChI=1S/C23H38NO4PS/c1-22(2,3)10-11-30-15-17-4-5-19-13-20(7-6-18(19)12-17)21-8-9-23(24,14-21)16-28-29(25,26)27/h6-7,13,17,21H,4-5,8-12,14-16,24H2,1-3H3,(H2,25,26,27)/t17-,21+,23-/m1/s1
Reactome pathway
US Patent
n/an/an/an/a<10n/an/an/a60
Bristol-Myers Squibb Company
US Patent
Assay Description
Compounds were loaded in a 384 Falcon v-bottom plate (0.5 ul/well in a 11 point, 3-fold dilution). Membranes prepared from S1P1/CHO cells or EDG3-Gal...
US Patent US9522888 (2016)
BindingDB Entry DOI: 10.7270/Q20K27HV
Sphingosine 1-phosphate receptor 1
(Homo sapiens (Human))
BDBM65170
(US10166249, Example 519 | US9522888, 519)
Show SMILES CC(C)(C)CCSC[C@@H]1CCc2cc(ccc2C1)[C@H]1CC[C@](N)(COP(O)(O)=O)C1 |r|
Show InChI InChI=1S/C23H38NO4PS/c1-22(2,3)10-11-30-15-17-4-5-19-13-20(7-6-18(19)12-17)21-8-9-23(24,14-21)16-28-29(25,26)27/h6-7,13,17,21H,4-5,8-12,14-16,24H2,1-3H3,(H2,25,26,27)/t17-,21+,23-/m1/s1
Reactome pathway
US Patent
n/an/an/an/a<10n/an/an/a37
Bristol-Myers Squibb Company
US Patent
Assay Description
hS1P1/CHO cells were plated into BD Amine 384-well plates the day before the assay. On the day of the assay, growth medium was removed and replaced w...
US Patent US9522888 (2016)
BindingDB Entry DOI: 10.7270/Q20K27HV
Sphingosine 1-phosphate receptor 3
(Homo sapiens (Human))
BDBM65170
(US10166249, Example 519 | US9522888, 519)
Show SMILES CC(C)(C)CCSC[C@@H]1CCc2cc(ccc2C1)[C@H]1CC[C@](N)(COP(O)(O)=O)C1 |r|
Show InChI InChI=1S/C23H38NO4PS/c1-22(2,3)10-11-30-15-17-4-5-19-13-20(7-6-18(19)12-17)21-8-9-23(24,14-21)16-28-29(25,26)27/h6-7,13,17,21H,4-5,8-12,14-16,24H2,1-3H3,(H2,25,26,27)/t17-,21+,23-/m1/s1
NCI pathway
Reactome pathway
US Patent
n/an/an/an/a>625n/an/an/an/a
Bristol-Myers Squibb Company
US Patent
Assay Description
Compounds were loaded in a 384 Falcon v-bottom plate (0.5 l/well in a 11 point, 3-fold dilution). Membranes prepared from S1P1/CHO cells or EDG3-Gal5...
US Patent US10166249 (2019)
BindingDB Entry DOI: 10.7270/Q2S75JCM
Sphingosine-1-phosphate lyase 1
(Homo sapiens (Human))
BDBM65170
(US10166249, Example 519 | US9522888, 519)
Show SMILES CC(C)(C)CCSC[C@@H]1CCc2cc(ccc2C1)[C@H]1CC[C@](N)(COP(O)(O)=O)C1 |r|
Show InChI InChI=1S/C23H38NO4PS/c1-22(2,3)10-11-30-15-17-4-5-19-13-20(7-6-18(19)12-17)21-8-9-23(24,14-21)16-28-29(25,26)27/h6-7,13,17,21H,4-5,8-12,14-16,24H2,1-3H3,(H2,25,26,27)/t17-,21+,23-/m1/s1
US Patent
n/an/a<10n/an/an/an/an/an/a
Bristol-Myers Squibb Company
US Patent
Assay Description
Membranes were prepared from CHO cells expressing human S1P1. Cells pellets (1×109 cells/pellet) were suspended in buffer containing 20 mM HEPES (4-(...
US Patent US10166249 (2019)
BindingDB Entry DOI: 10.7270/Q2S75JCM
Sphingosine-1-phosphate lyase 1
(Homo sapiens (Human))
BDBM65170
(US10166249, Example 519 | US9522888, 519)
Show SMILES CC(C)(C)CCSC[C@@H]1CCc2cc(ccc2C1)[C@H]1CC[C@](N)(COP(O)(O)=O)C1 |r|
Show InChI InChI=1S/C23H38NO4PS/c1-22(2,3)10-11-30-15-17-4-5-19-13-20(7-6-18(19)12-17)21-8-9-23(24,14-21)16-28-29(25,26)27/h6-7,13,17,21H,4-5,8-12,14-16,24H2,1-3H3,(H2,25,26,27)/t17-,21+,23-/m1/s1
US Patent
n/an/an/an/a<10n/an/an/an/a
Bristol-Myers Squibb Company
US Patent
Assay Description
Compounds were loaded in a 384 Falcon v-bottom plate (0.5 l/well in a 11 point, 3-fold dilution). Membranes prepared from S1P1/CHO cells or EDG3-Gal5...
US Patent US10166249 (2019)
BindingDB Entry DOI: 10.7270/Q2S75JCM
Sphingosine-1-phosphate lyase 1
(Homo sapiens (Human))
BDBM65170
(US10166249, Example 519 | US9522888, 519)
Show SMILES CC(C)(C)CCSC[C@@H]1CCc2cc(ccc2C1)[C@H]1CC[C@](N)(COP(O)(O)=O)C1 |r|
Show InChI InChI=1S/C23H38NO4PS/c1-22(2,3)10-11-30-15-17-4-5-19-13-20(7-6-18(19)12-17)21-8-9-23(24,14-21)16-28-29(25,26)27/h6-7,13,17,21H,4-5,8-12,14-16,24H2,1-3H3,(H2,25,26,27)/t17-,21+,23-/m1/s1
US Patent
n/an/an/an/a<10n/an/an/an/a
Bristol-Myers Squibb Company
US Patent
Assay Description
hS1P1/CHO cells were plated into BD Amine 384-well plates the day before the assay. On the day of the assay, growth medium was removed and replaced w...
US Patent US10166249 (2019)
BindingDB Entry DOI: 10.7270/Q2S75JCM
Sphingosine 1-phosphate receptor 3
(Homo sapiens (Human))
BDBM65170
(US10166249, Example 519 | US9522888, 519)
Show SMILES CC(C)(C)CCSC[C@@H]1CCc2cc(ccc2C1)[C@H]1CC[C@](N)(COP(O)(O)=O)C1 |r|
Show InChI InChI=1S/C23H38NO4PS/c1-22(2,3)10-11-30-15-17-4-5-19-13-20(7-6-18(19)12-17)21-8-9-23(24,14-21)16-28-29(25,26)27/h6-7,13,17,21H,4-5,8-12,14-16,24H2,1-3H3,(H2,25,26,27)/t17-,21+,23-/m1/s1
NCI pathway
Reactome pathway
US Patent
n/an/an/an/a>625n/an/an/a60
Bristol-Myers Squibb Company
US Patent
Assay Description
Compounds were loaded in a 384 Falcon v-bottom plate (0.5 ul/well in a 11 point, 3-fold dilution). Membranes prepared from S1P1/CHO cells or EDG3-Gal...
US Patent US9522888 (2016)
BindingDB Entry DOI: 10.7270/Q20K27HV