BDBM65199 US9522888, 540
SMILES: COCC[C@@H]1CCc2cc(ccc2C1)[C@H]1CC[C@](N)(COP(O)(O)=O)C1
InChI Key: InChIKey=FWYZNCDCDHDYPQ-ZOCIIQOWSA-N
Data: 1 IC50  3 EC50
Activity Spreadsheet -- Enzyme Inhibition Constant Data from BindingDB
Found 4 hits for monomerid = 65199
Trg + Lig
Ki
nM
ΔG°
kcal/mole
IC50
nM
Kd
nM
EC50/IC50
nM
koff
s-1
kon
M-1s-1
pHTemp
°C
Sphingosine 1-phosphate receptor 1
(Homo sapiens (Human))
BDBM65199
(US9522888, 540)
Show SMILES COCC[C@@H]1CCc2cc(ccc2C1)[C@H]1CC[C@](N)(COP(O)(O)=O)C1 |r|
Show InChI InChI=1S/C19H30NO5P/c1-24-9-7-14-2-3-16-11-17(5-4-15(16)10-14)18-6-8-19(20,12-18)13-25-26(21,22)23/h4-5,11,14,18H,2-3,6-10,12-13,20H2,1H3,(H2,21,22,23)/t14-,18-,19+/m0/s1
Reactome pathway
US Patent
n/an/a<10n/an/an/an/a7.525
Bristol-Myers Squibb Company
US Patent
Assay Description
Membranes were prepared from CHO cells expressing human S1P1. Cells pellets (1x10^9 cells/pellet) were suspended in buffer containing 20 mM HEPES (4-...
US Patent US9522888 (2016)
BindingDB Entry DOI: 10.7270/Q20K27HV
Sphingosine 1-phosphate receptor 3
(Homo sapiens (Human))
BDBM65199
(US9522888, 540)
Show SMILES COCC[C@@H]1CCc2cc(ccc2C1)[C@H]1CC[C@](N)(COP(O)(O)=O)C1 |r|
Show InChI InChI=1S/C19H30NO5P/c1-24-9-7-14-2-3-16-11-17(5-4-15(16)10-14)18-6-8-19(20,12-18)13-25-26(21,22)23/h4-5,11,14,18H,2-3,6-10,12-13,20H2,1H3,(H2,21,22,23)/t14-,18-,19+/m0/s1
NCI pathway
Reactome pathway
US Patent
n/an/an/an/a>625n/an/an/a60
Bristol-Myers Squibb Company
US Patent
Assay Description
Compounds were loaded in a 384 Falcon v-bottom plate (0.5 ul/well in a 11 point, 3-fold dilution). Membranes prepared from S1P1/CHO cells or EDG3-Gal...
US Patent US9522888 (2016)
BindingDB Entry DOI: 10.7270/Q20K27HV
Sphingosine 1-phosphate receptor 1
(Homo sapiens (Human))
BDBM65199
(US9522888, 540)
Show SMILES COCC[C@@H]1CCc2cc(ccc2C1)[C@H]1CC[C@](N)(COP(O)(O)=O)C1 |r|
Show InChI InChI=1S/C19H30NO5P/c1-24-9-7-14-2-3-16-11-17(5-4-15(16)10-14)18-6-8-19(20,12-18)13-25-26(21,22)23/h4-5,11,14,18H,2-3,6-10,12-13,20H2,1H3,(H2,21,22,23)/t14-,18-,19+/m0/s1
Reactome pathway
US Patent
n/an/an/an/a<10n/an/an/a37
Bristol-Myers Squibb Company
US Patent
Assay Description
hS1P1/CHO cells were plated into BD Amine 384-well plates the day before the assay. On the day of the assay, growth medium was removed and replaced w...
US Patent US9522888 (2016)
BindingDB Entry DOI: 10.7270/Q20K27HV
Sphingosine 1-phosphate receptor 1
(Homo sapiens (Human))
BDBM65199
(US9522888, 540)
Show SMILES COCC[C@@H]1CCc2cc(ccc2C1)[C@H]1CC[C@](N)(COP(O)(O)=O)C1 |r|
Show InChI InChI=1S/C19H30NO5P/c1-24-9-7-14-2-3-16-11-17(5-4-15(16)10-14)18-6-8-19(20,12-18)13-25-26(21,22)23/h4-5,11,14,18H,2-3,6-10,12-13,20H2,1H3,(H2,21,22,23)/t14-,18-,19+/m0/s1
Reactome pathway
US Patent
n/an/an/an/a 550n/an/an/a60
Bristol-Myers Squibb Company
US Patent
Assay Description
Compounds were loaded in a 384 Falcon v-bottom plate (0.5 ul/well in a 11 point, 3-fold dilution). Membranes prepared from S1P1/CHO cells or EDG3-Gal...
US Patent US9522888 (2016)
BindingDB Entry DOI: 10.7270/Q20K27HV