BDBM652 (3R,4R)-4-{[(2R,4S)-2-[(R)-(benzylcarbamoyl)(1-phenylacetamido)methyl]-5,5-dimethyl-1,3-thiazolidin-4-yl]formamido}-3-hydroxy-5-phenylpentanamide::penicillin deriv. 65
SMILES: [H][C@]1(N[C@@H](C(=O)N[C@H](Cc2ccccc2)[C@H](O)CC(N)=O)C(C)(C)S1)[C@H](NC(=O)Cc1ccccc1)C(=O)NCc1ccccc1
InChI Key: InChIKey=KMGABVMIQPZZHU-MOYXPMDPSA-N
Data: 1 IC50
PDB links: 1 PDB ID contains this monomer as substructures. 1 PDB ID contains inhibitors having a similarity of 90% to this monomer.
Activity Spreadsheet -- Enzyme Inhibition Constant Data from BindingDB
Found 1 hit for monomerid = 652
Trg + Lig
Ki
nM
ΔG°
kcal/mole
IC50
nM
Kd
nM
EC50/IC50
nM
koff
s-1
kon
M-1s-1
pHTemp
°C
HIV-1 Protease
(Human immunodeficiency virus type 1)
BDBM652
((3R,4R)-4-{[(2R,4S)-2-[(R)-(benzylcarbamoyl)(1-phe...)
Show SMILES [H][C@]1(N[C@@H](C(=O)N[C@H](Cc2ccccc2)[C@H](O)CC(N)=O)C(C)(C)S1)[C@H](NC(=O)Cc1ccccc1)C(=O)NCc1ccccc1 |r|
Show InChI InChI=1S/C34H41N5O5S/c1-34(2)30(32(44)37-25(26(40)20-27(35)41)18-22-12-6-3-7-13-22)39-33(45-34)29(31(43)36-21-24-16-10-5-11-17-24)38-28(42)19-23-14-8-4-9-15-23/h3-17,25-26,29-30,33,39-40H,18-21H2,1-2H3,(H2,35,41)(H,36,43)(H,37,44)(H,38,42)/t25-,26-,29-,30+,33-/m1/s1
n/an/a 82n/an/an/an/a6.037
Glaxo Group Research Ltd.
Assay Description
IC50 values were obtained by assaying the enzyme against the synthetic substrate peptide KQGTVSFNFPQIT, which was tritiated at the proline residue, a...
J Med Chem 36: 3129-36 (1993)
Article DOI: 10.1021/jm00073a012
BindingDB Entry DOI: 10.7270/Q20P0X6C