BDBM65203 4-Methoxy-N-[N'-(pyrazine-2-carbonyl)-hydrazinocarbothioyl]-benzamide::4-methoxy-N-[(pyrazin-2-ylcarbonylamino)carbamothioyl]benzamide::4-methoxy-N-[(pyrazine-2-carbonylamino)carbamothioyl]benzamide::4-methoxy-N-[(pyrazinoylamino)thiocarbamoyl]benzamide::4-methoxy-N-[[[oxo(2-pyrazinyl)methyl]hydrazo]-sulfanylidenemethyl]benzamide::MLS000590652::SMR000219103::cid_3290873
SMILES: COc1ccc(cc1)C(=O)NC(=S)NNC(=O)c1cnccn1
InChI Key: InChIKey=GPZSWRSLVKGCCV-UHFFFAOYSA-N
Data: 1 EC50
Activity Spreadsheet -- Enzyme Inhibition Constant Data from BindingDB
Found 1 hit for monomerid = 65203
Trg + Lig
Ki
nM
ΔG°
kcal/mole
IC50
nM
Kd
nM
EC50/IC50
nM
koff
s-1
kon
M-1s-1
pHTemp
°C
LAP4
(Saccharomyces cerevisiae)
BDBM65203
(4-Methoxy-N-[N'-(pyrazine-2-carbonyl)-hydrazin...)
Show SMILES COc1ccc(cc1)C(=O)NC(=S)NNC(=O)c1cnccn1
Show InChI InChI=1S/C14H13N5O3S/c1-22-10-4-2-9(3-5-10)12(20)17-14(23)19-18-13(21)11-8-15-6-7-16-11/h2-8H,1H3,(H,18,21)(H2,17,19,20,23)
PCBioAssay
n/an/an/an/a 1.32E+3n/an/an/an/a
NMMLSC
Curated by PubChem BioAssay
Assay Description
University of New Mexico Assay Overview: Assay Support: 1R03 MH086450-01 Project Title: Chemical Screen of TOR pathway GFP fusion proteins in S. ...
PubChem Bioassay (2010)
BindingDB Entry DOI: 10.7270/Q21R6P02