null
SMILES: [H][C@]1(N[C@@H](C(=O)N[C@H](Cc2ccccc2)[C@H](O)CC(=O)NCC(C)C)C(C)(C)S1)[C@H](NC(=O)Cc1ccccc1)C(=O)NCc1ccccc1
InChI Key: InChIKey=VASWCZNNYHXDLS-RKSPLQEMSA-N
PDB links: 1 PDB ID contains inhibitors having a similarity of 90% to this monomer.
Activity Spreadsheet -- Enzyme Inhibition Constant Data from BindingDB
Found 1 hit for monomerid = 654
Trg + Lig
Ki
nM
ΔG°
kcal/mole
IC50
nM
Kd
nM
EC50/IC50
nM
koff
s-1
kon
M-1s-1
pHTemp
°C
Dimer of Gag-Pol polyprotein [489-587]
(Human immunodeficiency virus type 1)
BDBM654
((3R,4R)-4-{[(2R,4S)-2-[(R)-(benzylcarbamoyl)(1-phe...)
Show SMILES [H][C@]1(N[C@@H](C(=O)N[C@H](Cc2ccccc2)[C@H](O)CC(=O)NCC(C)C)C(C)(C)S1)[C@H](NC(=O)Cc1ccccc1)C(=O)NCc1ccccc1 |r|
Show InChI InChI=1S/C38H49N5O5S/c1-25(2)23-39-31(45)22-30(44)29(20-26-14-8-5-9-15-26)41-36(48)34-38(3,4)49-37(43-34)33(35(47)40-24-28-18-12-7-13-19-28)42-32(46)21-27-16-10-6-11-17-27/h5-19,25,29-30,33-34,37,43-44H,20-24H2,1-4H3,(H,39,45)(H,40,47)(H,41,48)(H,42,46)/t29-,30-,33-,34+,37-/m1/s1
n/an/a 69n/an/an/an/a6.037
Glaxo Group Research Ltd.
Assay Description
IC50 values were obtained by assaying the enzyme against the synthetic substrate peptide KQGTVSFNFPQIT, which was tritiated at the proline residue, a...
J Med Chem 36: 3129-36 (1993)
Article DOI: 10.1021/jm00073a012
BindingDB Entry DOI: 10.7270/Q20P0X6C