BDBM65590 US9693997, 8
SMILES: CC(C)(C)NC(=O)c1ccc(cc1)-c1c(Cl)cc(Nc2n[nH]c(N)n2)cc1Cl
InChI Key: InChIKey=JVQKXIXHJWYPDP-UHFFFAOYSA-N
Data: 1 EC50
Activity Spreadsheet -- Enzyme Inhibition Constant Data from BindingDB
Found 1 hit for monomerid = 65590
Trg + Lig
Ki
nM
ΔG°
kcal/mole
IC50
nM
Kd
nM
EC50/IC50
nM
koff
s-1
kon
M-1s-1
pHTemp
°C
HCV NS3-NS4A Serine Proteinase
(Hepatitis C virus (HCV genotype 1a, isolate H))
BDBM65590
(US9693997, 8)
Show SMILES CC(C)(C)NC(=O)c1ccc(cc1)-c1c(Cl)cc(Nc2n[nH]c(N)n2)cc1Cl
Show InChI InChI=1S/C19H20Cl2N6O/c1-19(2,3)25-16(28)11-6-4-10(5-7-11)15-13(20)8-12(9-14(15)21)23-18-24-17(22)26-27-18/h4-9H,1-3H3,(H,25,28)(H4,22,23,24,26,27)
US Patent
n/an/an/an/a 13n/an/an/an/a
HOFFMANN-LA ROCHE INC.
US Patent
Assay Description
Plasmids expressing HCV E1 and E2 envelope proteins of GT1a H77 strain (Proc Natl Acad Sci USA 1997 94:8738-43) or GT1b Con1 strain (Science 1999 285...
US Patent US9693997 (2017)
BindingDB Entry DOI: 10.7270/Q2833Q56