BDBM65591 US9693997, 9
SMILES: CCCCC(=O)Nc1ccc(cc1)-c1c(Cl)cc(Nc2n[nH]c(N)n2)cc1Cl
InChI Key: InChIKey=FFISWIHUXMDGOM-UHFFFAOYSA-N
Data: 1 EC50
Activity Spreadsheet -- Enzyme Inhibition Constant Data from BindingDB
Found 1 hit for monomerid = 65591
Trg + Lig
Ki
nM
ΔG°
kcal/mole
IC50
nM
Kd
nM
EC50/IC50
nM
koff
s-1
kon
M-1s-1
pHTemp
°C
Genome polyprotein
(Hepatitis C virus (HCV genotype 1a, isolate H))
BDBM65591
(US9693997, 9)
Show SMILES CCCCC(=O)Nc1ccc(cc1)-c1c(Cl)cc(Nc2n[nH]c(N)n2)cc1Cl |$;;;;;;HN;;;;;;;;;;;;;;;;;;;;;$|
Show InChI InChI=1S/C19H20Cl2N6O/c1-2-3-4-16(28)23-12-7-5-11(6-8-12)17-14(20)9-13(10-15(17)21)24-19-25-18(22)26-27-19/h5-10H,2-4H2,1H3,(H,23,28)(H4,22,24,25,26,27)
US Patent
n/an/an/an/a 14n/an/an/an/a
HOFFMANN-LA ROCHE INC.
US Patent
Assay Description
Plasmids expressing HCV E1 and E2 envelope proteins of GT1a H77 strain (Proc Natl Acad Sci USA 1997 94:8738-43) or GT1b Con1 strain (Science 1999 285...
US Patent US9693997 (2017)
BindingDB Entry DOI: 10.7270/Q2833Q56