BDBM6579 (Benzo[b]furan-2-yl)(5-methoxy-1H-2-indolyl)methanone::2-(1-benzofuran-2-ylcarbonyl)-5-methoxy-1H-indole::Bis(1H-2-indolyl)methanone 17
SMILES: COc1ccc2[nH]c(cc2c1)C(=O)c1cc2ccccc2o1
InChI Key: InChIKey=YSZYOYLIZMQKMV-UHFFFAOYSA-N
Data: 1 IC50
Activity Spreadsheet -- Enzyme Inhibition Constant Data from BindingDB
Found 1 hit for monomerid = 6579
Trg + Lig
Ki
nM
ΔG°
kcal/mole
IC50
nM
Kd
nM
EC50/IC50
nM
koff
s-1
kon
M-1s-1
pHTemp
°C
Platelet-derived growth factor receptor beta
(Homo sapiens (Human))
BDBM6579
((Benzo[b]furan-2-yl)(5-methoxy-1H-2-indolyl)methan...)
Show SMILES COc1ccc2[nH]c(cc2c1)C(=O)c1cc2ccccc2o1
Show InChI InChI=1S/C18H13NO3/c1-21-13-6-7-14-12(8-13)9-15(19-14)18(20)17-10-11-4-2-3-5-16(11)22-17/h2-10,19H,1H3
NCI pathway
Reactome pathway
n/an/a 4.00E+3n/an/an/an/a7.422
University of Regensburg
Assay Description
The cells were stimulated with PDGF (100 ng/mL) for 10 min at room temperature. Then the cell lysates were analyzed by SDS-PAGE and immunoblotting wi...
J Med Chem 45: 1002-18 (2002)
Article DOI: 10.1021/jm010988n
BindingDB Entry DOI: 10.7270/Q2GM85H0