null
SMILES: O=C(c1cc2ccccc2s1)c1cc2ccccc2s1
InChI Key: InChIKey=XGEOFOPAAWHTSM-UHFFFAOYSA-N
Activity Spreadsheet -- Enzyme Inhibition Constant Data from BindingDB
Found 1 hit for monomerid = 6580
Trg + Lig
Ki
nM
ΔG°
kcal/mole
IC50
nM
Kd
nM
EC50/IC50
nM
koff
s-1
kon
M-1s-1
pHTemp
°C
Platelet-derived growth factor receptor beta
(Homo sapiens (Human))
BDBM6580
(Bis(1H-2-indolyl)methanone 18 | bis(1-benzothiophe...)
Show SMILES O=C(c1cc2ccccc2s1)c1cc2ccccc2s1
Show InChI InChI=1S/C17H10OS2/c18-17(15-9-11-5-1-3-7-13(11)19-15)16-10-12-6-2-4-8-14(12)20-16/h1-10H
NCI pathway
Reactome pathway
n/an/a>3.00E+4n/an/an/an/a7.422
University of Regensburg
Assay Description
The cells were stimulated with PDGF (100 ng/mL) for 10 min at room temperature. Then the cell lysates were analyzed by SDS-PAGE and immunoblotting wi...
J Med Chem 45: 1002-18 (2002)
Article DOI: 10.1021/jm010988n
BindingDB Entry DOI: 10.7270/Q2GM85H0