BDBM6582 5-(benzyloxy)-2-(1H-indol-2-ylcarbonyl)-1H-indole::Bis(1H-2-indolyl)methanone 40
SMILES: O=C(c1cc2ccccc2[nH]1)c1cc2cc(OCc3ccccc3)ccc2[nH]1
InChI Key: InChIKey=XOXXUQMBOKKTMI-UHFFFAOYSA-N
Data: 1 IC50
Activity Spreadsheet -- Enzyme Inhibition Constant Data from BindingDB
Found 1 hit for monomerid = 6582
Trg + Lig
Ki
nM
ΔG°
kcal/mole
IC50
nM
Kd
nM
EC50/IC50
nM
koff
s-1
kon
M-1s-1
pHTemp
°C
Platelet-derived growth factor receptor beta
(Homo sapiens (Human))
BDBM6582
(5-(benzyloxy)-2-(1H-indol-2-ylcarbonyl)-1H-indole ...)
Show SMILES O=C(c1cc2ccccc2[nH]1)c1cc2cc(OCc3ccccc3)ccc2[nH]1
Show InChI InChI=1S/C24H18N2O2/c27-24(22-13-17-8-4-5-9-20(17)25-22)23-14-18-12-19(10-11-21(18)26-23)28-15-16-6-2-1-3-7-16/h1-14,25-26H,15H2
NCI pathway
Reactome pathway
n/an/a 2.00E+4n/an/an/an/a7.422
University of Regensburg
Assay Description
The cells were stimulated with PDGF (100 ng/mL) for 10 min at room temperature. Then the cell lysates were analyzed by SDS-PAGE and immunoblotting wi...
J Med Chem 45: 1002-18 (2002)
Article DOI: 10.1021/jm010988n
BindingDB Entry DOI: 10.7270/Q2GM85H0