BDBM6593 2-(1H-indol-2-ylcarbonyl)-1H-indol-5-yl 4-methoxybenzoate::Bis(1H-2-indolyl)methanone deriv. 51::[2-(1H-2-Indolylcarbonyl)-1H-5-indolyl]-4-methoxybenzoate
SMILES: COc1ccc(cc1)C(=O)Oc1ccc2[nH]c(cc2c1)C(=O)c1cc2ccccc2[nH]1
InChI Key: InChIKey=VXMZSTNSIWVTAF-UHFFFAOYSA-N
Data: 1 IC50
Activity Spreadsheet -- Enzyme Inhibition Constant Data from BindingDB
Found 1 hit for monomerid = 6593
Trg + Lig
Ki
nM
ΔG°
kcal/mole
IC50
nM
Kd
nM
EC50/IC50
nM
koff
s-1
kon
M-1s-1
pHTemp
°C
Platelet-derived growth factor receptor beta
(Homo sapiens (Human))
BDBM6593
(2-(1H-indol-2-ylcarbonyl)-1H-indol-5-yl 4-methoxyb...)
Show SMILES COc1ccc(cc1)C(=O)Oc1ccc2[nH]c(cc2c1)C(=O)c1cc2ccccc2[nH]1
Show InChI InChI=1S/C25H18N2O4/c1-30-18-8-6-15(7-9-18)25(29)31-19-10-11-21-17(12-19)14-23(27-21)24(28)22-13-16-4-2-3-5-20(16)26-22/h2-14,26-27H,1H3
NCI pathway
Reactome pathway
n/an/a 3.20E+3n/an/an/an/an/a25
University of Regensburg
Assay Description
The cells were stimulated with PDGF (100 ng/mL) for 10 min at room temperature. Then the cell lysates were analyzed by SDS-PAGE and immunoblotting wi...
J Med Chem 45: 1002-18 (2002)
Article DOI: 10.1021/jm010988n
BindingDB Entry DOI: 10.7270/Q2GM85H0