BDBM6599 2-(1H-indol-2-ylcarbonyl)-1H-indol-5-yl 4-phenylbenzoate::Bis(1H-2-indolyl)methanone deriv. 57::[2-(1H-2-Indolylcarbonyl)-1H-5-indolyl]-4-phenylbenzoate
SMILES: O=C(Oc1ccc2[nH]c(cc2c1)C(=O)c1cc2ccccc2[nH]1)c1ccc(cc1)-c1ccccc1
InChI Key: InChIKey=VASWDTUNMOTAEW-UHFFFAOYSA-N
Data: 1 IC50
Activity Spreadsheet -- Enzyme Inhibition Constant Data from BindingDB
Found 1 hit for monomerid = 6599
Trg + Lig
Ki
nM
ΔG°
kcal/mole
IC50
nM
Kd
nM
EC50/IC50
nM
koff
s-1
kon
M-1s-1
pHTemp
°C
Platelet-derived growth factor receptor beta
(Homo sapiens (Human))
BDBM6599
(2-(1H-indol-2-ylcarbonyl)-1H-indol-5-yl 4-phenylbe...)
Show SMILES O=C(Oc1ccc2[nH]c(cc2c1)C(=O)c1cc2ccccc2[nH]1)c1ccc(cc1)-c1ccccc1
Show InChI InChI=1S/C30H20N2O3/c33-29(27-17-22-8-4-5-9-25(22)31-27)28-18-23-16-24(14-15-26(23)32-28)35-30(34)21-12-10-20(11-13-21)19-6-2-1-3-7-19/h1-18,31-32H
NCI pathway
Reactome pathway
n/an/a 1.70E+3n/an/an/an/an/a25
University of Regensburg
Assay Description
The cells were stimulated with PDGF (100 ng/mL) for 10 min at room temperature. Then the cell lysates were analyzed by SDS-PAGE and immunoblotting wi...
J Med Chem 45: 1002-18 (2002)
Article DOI: 10.1021/jm010988n
BindingDB Entry DOI: 10.7270/Q2GM85H0