BDBM6605 2-(1H-indol-2-ylcarbonyl)-1H-indol-5-yl 4-nitrobenzoate::Bis(1H-2-indolyl)methanone deriv. 63::[2-(1H-2-Indolylcarbonyl)-1H-5-indolyl]-4-nitrobenzoate
SMILES: [O-][N+](=O)c1ccc(cc1)C(=O)Oc1ccc2[nH]c(cc2c1)C(=O)c1cc2ccccc2[nH]1
InChI Key: InChIKey=DPABDEZWNGZKIM-UHFFFAOYSA-N
Data: 1 IC50
Activity Spreadsheet -- Enzyme Inhibition Constant Data from BindingDB
Found 1 hit for monomerid = 6605
Trg + Lig
Ki
nM
ΔG°
kcal/mole
IC50
nM
Kd
nM
EC50/IC50
nM
koff
s-1
kon
M-1s-1
pHTemp
°C
Platelet-derived growth factor receptor beta
(Homo sapiens (Human))
BDBM6605
(2-(1H-indol-2-ylcarbonyl)-1H-indol-5-yl 4-nitroben...)
Show SMILES [O-][N+](=O)c1ccc(cc1)C(=O)Oc1ccc2[nH]c(cc2c1)C(=O)c1cc2ccccc2[nH]1
Show InChI InChI=1S/C24H15N3O5/c28-23(21-12-15-3-1-2-4-19(15)25-21)22-13-16-11-18(9-10-20(16)26-22)32-24(29)14-5-7-17(8-6-14)27(30)31/h1-13,25-26H
NCI pathway
Reactome pathway
n/an/a 900n/an/an/an/an/a25
University of Regensburg
Assay Description
The cells were stimulated with PDGF (100 ng/mL) for 10 min at room temperature. Then the cell lysates were analyzed by SDS-PAGE and immunoblotting wi...
J Med Chem 45: 1002-18 (2002)
Article DOI: 10.1021/jm010988n
BindingDB Entry DOI: 10.7270/Q2GM85H0