BDBM66123 9-aminopyrido[1,2-a]quinolinium::9-benzo[c]quinolizin-11-iumamine;perchlorate::MLS001180155::SMR000477592::benzo[c]quinolizin-11-ium-9-amine;perchlorate::benzo[c]quinolizin-11-ium-9-ylamine;perchlorate::cid_23723895
SMILES: Nc1ccc2ccc3cccc[n+]3c2c1
InChI Key: InChIKey=XJBARQYBLOTCGR-UHFFFAOYSA-O
Data: 3 IC50  1 EC50
Activity Spreadsheet -- Enzyme Inhibition Constant Data from BindingDB
Found 4 hits for monomerid = 66123
Trg + Lig
Ki
nM
ΔG°
kcal/mole
IC50
nM
Kd
nM
EC50/IC50
nM
koff
s-1
kon
M-1s-1
pHTemp
°C
Beta lactamase
(Pseudomonas aeruginosa)
BDBM66123
(9-aminopyrido[1,2-a]quinolinium | 9-benzo[c]quinol...)
Show SMILES Nc1ccc2ccc3cccc[n+]3c2c1
Show InChI InChI=1S/C13H10N2/c14-11-6-4-10-5-7-12-3-1-2-8-15(12)13(10)9-11/h1-9,14H/p+1
PCBioAssay
n/an/a 9.33E+3n/an/an/an/an/an/a
The Scripps Research Institute Molecular Screening Center
Curated by PubChem BioAssay
Assay Description
Source (MLPCN Center Name): The Scripps Research Institute Molecular Screening Center (SRIMSC) Center Affiliation: The Scripps Research Institute (TS...
PubChem Bioassay (2010)
BindingDB Entry DOI: 10.7270/Q2S75DSB
LANA
(Human herpesvirus 8)
BDBM66123
(9-aminopyrido[1,2-a]quinolinium | 9-benzo[c]quinol...)
Show SMILES Nc1ccc2ccc3cccc[n+]3c2c1
Show InChI InChI=1S/C13H10N2/c14-11-6-4-10-5-7-12-3-1-2-8-15(12)13(10)9-11/h1-9,14H/p+1
PCBioAssay
n/an/an/an/a 6.54E+3n/an/an/an/a
Broad Institute
Curated by PubChem BioAssay
Assay Description
Primary Collaborators: Kenneth Kaye,Brigham & Womens,Boston MA,kkaye@rics.bwh.harvard.edu,617-525-4256 Chantal Beauchemin,Brigham & Womens,Boston MA,...
PubChem Bioassay (2010)
BindingDB Entry DOI: 10.7270/Q2HH6HHN
metallo-beta-lactamase IMP-1
(Pseudomonas aeruginosa)
BDBM66123
(9-aminopyrido[1,2-a]quinolinium | 9-benzo[c]quinol...)
Show SMILES Nc1ccc2ccc3cccc[n+]3c2c1
Show InChI InChI=1S/C13H10N2/c14-11-6-4-10-5-7-12-3-1-2-8-15(12)13(10)9-11/h1-9,14H/p+1
PCBioAssay
n/an/a 1.61E+4n/an/an/an/an/an/a
The Scripps Research Institute Molecular Screening Center
Curated by PubChem BioAssay
Assay Description
Source (MLPCN Center Name): The Scripps Research Institute Molecular Screening Center (SRIMSC) Center Affiliation: The Scripps Research Institute (TS...
PubChem Bioassay (2010)
BindingDB Entry DOI: 10.7270/Q2HT2MRM
beta-lactamase
(Salmonella enterica subsp. enterica serovar Choler...)
BDBM66123
(9-aminopyrido[1,2-a]quinolinium | 9-benzo[c]quinol...)
Show SMILES Nc1ccc2ccc3cccc[n+]3c2c1
Show InChI InChI=1S/C13H10N2/c14-11-6-4-10-5-7-12-3-1-2-8-15(12)13(10)9-11/h1-9,14H/p+1
PCBioAssay
n/an/a 7.62E+3n/an/an/an/an/an/a
The Scripps Research Institute Molecular Screening Center
Curated by PubChem BioAssay
Assay Description
Source (MLPCN Center Name): The Scripps Research Institute Molecular Screening Center (SRIMSC) Center Affiliation: The Scripps Research Institute (TS...
PubChem Bioassay (2010)
BindingDB Entry DOI: 10.7270/Q2NG4P3G