BDBM66124 5-(4-nitrophenyl)-2-furaldehyde methyl(phenyl)hydrazone::MLS001164362::N-methyl-N-[[5-(4-nitrophenyl)-2-furanyl]methylideneamino]aniline::N-methyl-N-[[5-(4-nitrophenyl)furan-2-yl]methylideneamino]aniline::SMR000496563::cid_2848856::methyl-[[5-(4-nitrophenyl)-2-furyl]methyleneamino]-phenyl-amine
SMILES: CN(\N=C\c1ccc(o1)-c1ccc(cc1)[N+]([O-])=O)c1ccccc1
InChI Key: InChIKey=ULIJMUFRLZVTBX-CPNJWEJPSA-N
Data: 3 IC50  1 EC50
Activity Spreadsheet -- Enzyme Inhibition Constant Data from BindingDB
Found 4 hits for monomerid = 66124
Trg + Lig
Ki
nM
ΔG°
kcal/mole
IC50
nM
Kd
nM
EC50/IC50
nM
koff
s-1
kon
M-1s-1
pHTemp
°C
Beta lactamase
(Pseudomonas aeruginosa)
BDBM66124
(5-(4-nitrophenyl)-2-furaldehyde methyl(phenyl)hydr...)
Show SMILES CN(\N=C\c1ccc(o1)-c1ccc(cc1)[N+]([O-])=O)c1ccccc1
Show InChI InChI=1S/C18H15N3O3/c1-20(15-5-3-2-4-6-15)19-13-17-11-12-18(24-17)14-7-9-16(10-8-14)21(22)23/h2-13H,1H3/b19-13+
PCBioAssay
n/an/a>5.96E+4n/an/an/an/an/an/a
The Scripps Research Institute Molecular Screening Center
Curated by PubChem BioAssay
Assay Description
Source (MLPCN Center Name): The Scripps Research Institute Molecular Screening Center (SRIMSC) Center Affiliation: The Scripps Research Institute (TS...
PubChem Bioassay (2010)
BindingDB Entry DOI: 10.7270/Q2S75DSB
cardiac alpha tropomyosin
(Sus scrofa)
BDBM66124
(5-(4-nitrophenyl)-2-furaldehyde methyl(phenyl)hydr...)
Show SMILES CN(\N=C\c1ccc(o1)-c1ccc(cc1)[N+]([O-])=O)c1ccccc1
Show InChI InChI=1S/C18H15N3O3/c1-20(15-5-3-2-4-6-15)19-13-17-11-12-18(24-17)14-7-9-16(10-8-14)21(22)23/h2-13H,1H3/b19-13+
PCBioAssay
n/an/an/an/a 1.44E+3n/an/an/an/a
The Scripps Research Institute Molecular Screening Center
Curated by PubChem BioAssay
Assay Description
Source (MLPCN Center Name): The Scripps Research Institute Molecular Screening Center (SRIMSC) Affiliation: The Scripps Research Institute, TSRI Assa...
PubChem Bioassay (2011)
BindingDB Entry DOI: 10.7270/Q21N7ZKB
metallo-beta-lactamase IMP-1
(Pseudomonas aeruginosa)
BDBM66124
(5-(4-nitrophenyl)-2-furaldehyde methyl(phenyl)hydr...)
Show SMILES CN(\N=C\c1ccc(o1)-c1ccc(cc1)[N+]([O-])=O)c1ccccc1
Show InChI InChI=1S/C18H15N3O3/c1-20(15-5-3-2-4-6-15)19-13-17-11-12-18(24-17)14-7-9-16(10-8-14)21(22)23/h2-13H,1H3/b19-13+
PCBioAssay
n/an/a>5.96E+4n/an/an/an/an/an/a
The Scripps Research Institute Molecular Screening Center
Curated by PubChem BioAssay
Assay Description
Source (MLPCN Center Name): The Scripps Research Institute Molecular Screening Center (SRIMSC) Center Affiliation: The Scripps Research Institute (TS...
PubChem Bioassay (2010)
BindingDB Entry DOI: 10.7270/Q2HT2MRM
beta-lactamase
(Salmonella enterica subsp. enterica serovar Choler...)
BDBM66124
(5-(4-nitrophenyl)-2-furaldehyde methyl(phenyl)hydr...)
Show SMILES CN(\N=C\c1ccc(o1)-c1ccc(cc1)[N+]([O-])=O)c1ccccc1
Show InChI InChI=1S/C18H15N3O3/c1-20(15-5-3-2-4-6-15)19-13-17-11-12-18(24-17)14-7-9-16(10-8-14)21(22)23/h2-13H,1H3/b19-13+
PCBioAssay
n/an/a>5.96E+4n/an/an/an/an/an/a
The Scripps Research Institute Molecular Screening Center
Curated by PubChem BioAssay
Assay Description
Source (MLPCN Center Name): The Scripps Research Institute Molecular Screening Center (SRIMSC) Center Affiliation: The Scripps Research Institute (TS...
PubChem Bioassay (2010)
BindingDB Entry DOI: 10.7270/Q2NG4P3G