BDBM6633 3-[(9bS)-5-oxo-1H,2H,3H,5H,9bH-benzo[a]pyrrolizin-9-yl]-1-[5-({[(2S)-5-chloro-2,3-dihydro-1H-inden-2-yl]amino}methyl)-1H-pyrazol-3-yl]urea::N-[(9bS)-5-Oxo-2,3,5,9b-tetrahydro-1H-pyrrolo[2,1-a]-isoindol-9-yl]-N -[5-({[(2S)-5-chloro-2,3-dihydro-1Hinden-2-yl]amino}methyl)-1H-pyrazol-3-yl]urea::pyrazole-3-yl urea deriv. 15b
SMILES: Clc1ccc2C[C@@H](Cc2c1)NCc1cc(NC(=O)Nc2cccc3C(=O)N4CCC[C@H]4c23)[nH]n1
InChI Key: InChIKey=CGHADMRBCNGDHX-UWJYYQICSA-N
Data: 3 IC50
Activity Spreadsheet -- Enzyme Inhibition Constant Data from BindingDB
Found 3 hits for monomerid = 6633
Trg + Lig
Ki
nM
ΔG°
kcal/mole
IC50
nM
Kd
nM
EC50/IC50
nM
koff
s-1
kon
M-1s-1
pHTemp
°C
Cyclin-Dependent Kinase 2 (CDK2)
(Homo sapiens (Human))
BDBM6633
(3-[(9bS)-5-oxo-1H,2H,3H,5H,9bH-benzo[a]pyrrolizin-...)
Show SMILES Clc1ccc2C[C@@H](Cc2c1)NCc1cc(NC(=O)Nc2cccc3C(=O)N4CCC[C@H]4c23)[nH]n1 |r|
Show InChI InChI=1S/C25H25ClN6O2/c26-16-7-6-14-10-17(11-15(14)9-16)27-13-18-12-22(31-30-18)29-25(34)28-20-4-1-3-19-23(20)21-5-2-8-32(21)24(19)33/h1,3-4,6-7,9,12,17,21,27H,2,5,8,10-11,13H2,(H3,28,29,30,31,34)/t17-,21-/m0/s1
NCI pathway
Reactome pathway
n/an/a 440n/an/an/an/an/an/a
Banyu Tsukuba Research Institute
Assay Description
In vitro kinase assays using synthetic peptides and purified enzymes were incubated at 30°C for 45 min in buffer that contained 50 uM ATP, and d...
J Med Chem 44: 4628-40 (2001)
Article DOI: 10.1021/jm010326y
BindingDB Entry DOI: 10.7270/Q2BV7DS8
3D
3D Structure (docked)
Cyclin-Dependent Kinase 4 (CDK4)
(Homo sapiens (Human))
BDBM6633
(3-[(9bS)-5-oxo-1H,2H,3H,5H,9bH-benzo[a]pyrrolizin-...)
Show SMILES Clc1ccc2C[C@@H](Cc2c1)NCc1cc(NC(=O)Nc2cccc3C(=O)N4CCC[C@H]4c23)[nH]n1 |r|
Show InChI InChI=1S/C25H25ClN6O2/c26-16-7-6-14-10-17(11-15(14)9-16)27-13-18-12-22(31-30-18)29-25(34)28-20-4-1-3-19-23(20)21-5-2-8-32(21)24(19)33/h1,3-4,6-7,9,12,17,21,27H,2,5,8,10-11,13H2,(H3,28,29,30,31,34)/t17-,21-/m0/s1
NCI pathway
Reactome pathway
n/an/a 2.30n/an/an/an/an/an/a
Banyu Tsukuba Research Institute
Assay Description
In vitro kinase assays using synthetic peptides and purified enzymes were incubated at 30°C for 45 min in buffer that contained 50 uM ATP, and d...
J Med Chem 44: 4628-40 (2001)
Article DOI: 10.1021/jm010326y
BindingDB Entry DOI: 10.7270/Q2BV7DS8
Cyclin-Dependent Kinase 1 (CDK1)
(Homo sapiens (Human))
BDBM6633
(3-[(9bS)-5-oxo-1H,2H,3H,5H,9bH-benzo[a]pyrrolizin-...)
Show SMILES Clc1ccc2C[C@@H](Cc2c1)NCc1cc(NC(=O)Nc2cccc3C(=O)N4CCC[C@H]4c23)[nH]n1 |r|
Show InChI InChI=1S/C25H25ClN6O2/c26-16-7-6-14-10-17(11-15(14)9-16)27-13-18-12-22(31-30-18)29-25(34)28-20-4-1-3-19-23(20)21-5-2-8-32(21)24(19)33/h1,3-4,6-7,9,12,17,21,27H,2,5,8,10-11,13H2,(H3,28,29,30,31,34)/t17-,21-/m0/s1
Reactome pathway
n/an/a 1.80E+3n/an/an/an/an/an/a
Banyu Tsukuba Research Institute
Assay Description
In vitro kinase assays using synthetic peptides and purified enzymes were incubated at 30°C for 45 min in buffer that contained 50 uM ATP, and d...
J Med Chem 44: 4628-40 (2001)
Article DOI: 10.1021/jm010326y
BindingDB Entry DOI: 10.7270/Q2BV7DS8