BDBM6683 aminoimidazo[1,2-a]pyridine deriv. 18::{2-amino-6-[(2,6-difluorophenyl)carbonyl]imidazo[1,2-a]pyridin-3-yl}(2,6-difluorophenyl)methanethione
SMILES: Nc1nc2ccc(cn2c1C(=S)c1c(F)cccc1F)C(=O)c1c(F)cccc1F
InChI Key: InChIKey=HARCNHPDYDKMHE-UHFFFAOYSA-N
Data: 6 IC50
Activity Spreadsheet -- Enzyme Inhibition Constant Data from BindingDB
Found 6 hits for monomerid = 6683
Trg + Lig
Ki
nM
ΔG°
kcal/mole
IC50
nM
Kd
nM
EC50/IC50
nM
koff
s-1
kon
M-1s-1
pHTemp
°C
CDK2/CycE
(Homo sapiens (Human))
BDBM6683
(aminoimidazo[1,2-a]pyridine deriv. 18 | {2-amino-6...)
Show SMILES Nc1nc2ccc(cn2c1C(=S)c1c(F)cccc1F)C(=O)c1c(F)cccc1F
Show InChI InChI=1S/C21H11F4N3OS/c22-11-3-1-4-12(23)16(11)19(29)10-7-8-15-27-21(26)18(28(15)9-10)20(30)17-13(24)5-2-6-14(17)25/h1-9H,26H2
n/an/a 26n/an/an/an/a7.022
Avenida de la Industria
Assay Description
In vitro CDK assay using purified enzyme, was incubated at room temperature with substrate, and test compounds in the presence of ATP/[gamma-33P]ATP....
Bioorg Med Chem Lett 14: 6095-9 (2004)
Article DOI: 10.1016/j.bmcl.2004.09.053
BindingDB Entry DOI: 10.7270/Q2ZP44BV
Cyclin-Dependent Kinase 1 (CDK1)
(Homo sapiens (Human))
BDBM6683
(aminoimidazo[1,2-a]pyridine deriv. 18 | {2-amino-6...)
Show SMILES Nc1nc2ccc(cn2c1C(=S)c1c(F)cccc1F)C(=O)c1c(F)cccc1F
Show InChI InChI=1S/C21H11F4N3OS/c22-11-3-1-4-12(23)16(11)19(29)10-7-8-15-27-21(26)18(28(15)9-10)20(30)17-13(24)5-2-6-14(17)25/h1-9H,26H2
Reactome pathway
n/an/a 105n/an/an/an/an/a25
Avenida de la Industria
Assay Description
In vitro CDK assay using purified enzyme, was incubated at room temperature with substrate, and test compounds in the presence of ATP/[gamma-33P]ATP....
Bioorg Med Chem Lett 14: 6095-9 (2004)
Article DOI: 10.1016/j.bmcl.2004.09.053
BindingDB Entry DOI: 10.7270/Q2ZP44BV
Cyclin-Dependent Kinase 1 (CDK1)
(Homo sapiens (Human))
BDBM6683
(aminoimidazo[1,2-a]pyridine deriv. 18 | {2-amino-6...)
Show SMILES Nc1nc2ccc(cn2c1C(=S)c1c(F)cccc1F)C(=O)c1c(F)cccc1F
Show InChI InChI=1S/C21H11F4N3OS/c22-11-3-1-4-12(23)16(11)19(29)10-7-8-15-27-21(26)18(28(15)9-10)20(30)17-13(24)5-2-6-14(17)25/h1-9H,26H2
Reactome pathway
n/an/a 105n/an/an/an/an/an/a
University of South Australia Cancer Research Institute
Curated by ChEMBL
Assay Description
Inhibition of recombinant human CDK1/cyclin B expressed in baculovirus infected Sf9 insect cells using histone H1 as substrate in presence of [gamma3...
J Med Chem 62: 4233-4251 (2019)
Article DOI: 10.1021/acs.jmedchem.8b01469
Cyclin-Dependent Kinase 4 (CDK4)
(Homo sapiens (Human))
BDBM6683
(aminoimidazo[1,2-a]pyridine deriv. 18 | {2-amino-6...)
Show SMILES Nc1nc2ccc(cn2c1C(=S)c1c(F)cccc1F)C(=O)c1c(F)cccc1F
Show InChI InChI=1S/C21H11F4N3OS/c22-11-3-1-4-12(23)16(11)19(29)10-7-8-15-27-21(26)18(28(15)9-10)20(30)17-13(24)5-2-6-14(17)25/h1-9H,26H2
NCI pathway
Reactome pathway
n/an/a 786n/an/an/an/an/an/a
University of South Australia Cancer Research Institute
Curated by ChEMBL
Assay Description
Inhibition of CDK4/Cyclin D1 (unknown origin) using pRb (246 to 257 residues) as substrate in presence of [gamma33P]-ATP by topcount scintillation co...
J Med Chem 62: 4233-4251 (2019)
Article DOI: 10.1021/acs.jmedchem.8b01469
CDK2/CycE
(Homo sapiens (Human))
BDBM6683
(aminoimidazo[1,2-a]pyridine deriv. 18 | {2-amino-6...)
Show SMILES Nc1nc2ccc(cn2c1C(=S)c1c(F)cccc1F)C(=O)c1c(F)cccc1F
Show InChI InChI=1S/C21H11F4N3OS/c22-11-3-1-4-12(23)16(11)19(29)10-7-8-15-27-21(26)18(28(15)9-10)20(30)17-13(24)5-2-6-14(17)25/h1-9H,26H2
n/an/a 26n/an/an/an/an/an/a
University of South Australia Cancer Research Institute
Curated by ChEMBL
Assay Description
Inhibition of recombinant CDK2/Cyclin E (unknown origin) expressed in baculovirus infected Sf9 insect cells using pRb (246 to 257 residues) as substr...
J Med Chem 62: 4233-4251 (2019)
Article DOI: 10.1021/acs.jmedchem.8b01469
Cyclin-Dependent Kinase 4 (CDK4)
(Homo sapiens (Human))
BDBM6683
(aminoimidazo[1,2-a]pyridine deriv. 18 | {2-amino-6...)
Show SMILES Nc1nc2ccc(cn2c1C(=S)c1c(F)cccc1F)C(=O)c1c(F)cccc1F
Show InChI InChI=1S/C21H11F4N3OS/c22-11-3-1-4-12(23)16(11)19(29)10-7-8-15-27-21(26)18(28(15)9-10)20(30)17-13(24)5-2-6-14(17)25/h1-9H,26H2
NCI pathway
Reactome pathway
n/an/a 786n/an/an/an/an/a25
Avenida de la Industria
Assay Description
In vitro CDK assay using purified enzyme, was incubated at room temperature with substrate, and test compounds in the presence of ATP/[gamma-33P]ATP....
Bioorg Med Chem Lett 14: 6095-9 (2004)
Article DOI: 10.1016/j.bmcl.2004.09.053
BindingDB Entry DOI: 10.7270/Q2ZP44BV