null
SMILES: Nc1nc2ccc(cn2c1C(=O)c1c(F)cccc1F)C(=C)c1c(F)cccc1F
InChI Key: InChIKey=ICEZFAGZFCHSIY-UHFFFAOYSA-N
PDB links: 1 PDB ID contains inhibitors having a similarity of 90% to this monomer.
Activity Spreadsheet -- Enzyme Inhibition Constant Data from BindingDB
Found 3 hits for monomerid = 6688
Trg + Lig
Ki
nM
ΔG°
kcal/mole
IC50
nM
Kd
nM
EC50/IC50
nM
koff
s-1
kon
M-1s-1
pHTemp
°C
Cyclin-dependent kinase 2/G1/S-specific cyclin-E1
(Homo sapiens (Human))
BDBM6688
(3-[(2,6-difluorophenyl)carbonyl]-6-[1-(2,6-difluor...)
Show SMILES Nc1nc2ccc(cn2c1C(=O)c1c(F)cccc1F)C(=C)c1c(F)cccc1F
Show InChI InChI=1S/C22H13F4N3O/c1-11(18-13(23)4-2-5-14(18)24)12-8-9-17-28-22(27)20(29(17)10-12)21(30)19-15(25)6-3-7-16(19)26/h2-10H,1,27H2
n/an/a 63n/an/an/an/a7.022
Avenida de la Industria
Assay Description
In vitro CDK assay using purified enzyme, was incubated at room temperature with substrate, and test compounds in the presence of ATP/[gamma-33P]ATP....
Bioorg Med Chem Lett 14: 6095-9 (2004)
Article DOI: 10.1016/j.bmcl.2004.09.053
BindingDB Entry DOI: 10.7270/Q2ZP44BV
Cyclin-dependent kinase 4/G1/S-specific cyclin-D1
(Homo sapiens (Human))
BDBM6688
(3-[(2,6-difluorophenyl)carbonyl]-6-[1-(2,6-difluor...)
Show SMILES Nc1nc2ccc(cn2c1C(=O)c1c(F)cccc1F)C(=C)c1c(F)cccc1F
Show InChI InChI=1S/C22H13F4N3O/c1-11(18-13(23)4-2-5-14(18)24)12-8-9-17-28-22(27)20(29(17)10-12)21(30)19-15(25)6-3-7-16(19)26/h2-10H,1,27H2
NCI pathway
Reactome pathway
n/an/a 1.03E+3n/an/an/an/an/a25
Avenida de la Industria
Assay Description
In vitro CDK assay using purified enzyme, was incubated at room temperature with substrate, and test compounds in the presence of ATP/[gamma-33P]ATP....
Bioorg Med Chem Lett 14: 6095-9 (2004)
Article DOI: 10.1016/j.bmcl.2004.09.053
BindingDB Entry DOI: 10.7270/Q2ZP44BV
Cyclin-dependent kinase/G2/mitotic-specific cyclin- 1
(Homo sapiens (Human))
BDBM6688
(3-[(2,6-difluorophenyl)carbonyl]-6-[1-(2,6-difluor...)
Show SMILES Nc1nc2ccc(cn2c1C(=O)c1c(F)cccc1F)C(=C)c1c(F)cccc1F
Show InChI InChI=1S/C22H13F4N3O/c1-11(18-13(23)4-2-5-14(18)24)12-8-9-17-28-22(27)20(29(17)10-12)21(30)19-15(25)6-3-7-16(19)26/h2-10H,1,27H2
Reactome pathway
n/an/a 93n/an/an/an/an/a25
Avenida de la Industria
Assay Description
In vitro CDK assay using purified enzyme, was incubated at room temperature with substrate, and test compounds in the presence of ATP/[gamma-33P]ATP....
Bioorg Med Chem Lett 14: 6095-9 (2004)
Article DOI: 10.1016/j.bmcl.2004.09.053
BindingDB Entry DOI: 10.7270/Q2ZP44BV