null
SMILES: CCn1c(SCC(=O)Nc2ccc(cc2)C(C)=O)nc2c3ccccc3[nH]c2c1=O
InChI Key: InChIKey=VJONUUGXFFUDMV-UHFFFAOYSA-N
Activity Spreadsheet -- Enzyme Inhibition Constant Data from BindingDB
Found 1 hit for monomerid = 66942
Trg + Lig
Ki
nM
ΔG°
kcal/mole
IC50
nM
Kd
nM
EC50/IC50
nM
koff
s-1
kon
M-1s-1
pHTemp
°C
Bcl-2-like protein 11
(Homo sapiens (Human))
BDBM66942
(MLS001236021 | N-(4-acetylphenyl)-2-[(3-ethyl-4-ke...)
Show SMILES CCn1c(SCC(=O)Nc2ccc(cc2)C(C)=O)nc2c3ccccc3[nH]c2c1=O
Show InChI InChI=1S/C22H20N4O3S/c1-3-26-21(29)20-19(16-6-4-5-7-17(16)24-20)25-22(26)30-12-18(28)23-15-10-8-14(9-11-15)13(2)27/h4-11,24H,3,12H2,1-2H3,(H,23,28)
Reactome pathway
PCBioAssay
n/an/an/an/a 1.30E+4n/an/an/an/a
Broad Institute
Curated by PubChem BioAssay
Assay Description
Keywords: apoptosis, BH3 domain, Bcl2-A1, BIM, caspase, cancer Primary Collaborator: Todd Golub, Broad Institute, golub@broadinstitute.org Assay Over...
PubChem Bioassay (2010)
BindingDB Entry DOI: 10.7270/Q24J0CKJ