BDBM6708 7-fluoro-1,4,14,24-tetraazaheptacyclo[16.8.1.0^{2,17}.0^{3,11}.0^{5,10}.0^{12,16}.0^{22,27}]heptacosa-2(17),3(11),5(10),6,8,12(16),18(27),19,21-nonaene-13,15-dione hydrochloride::aza-1,7-annulated indole deriv. 12c
SMILES: Fc1ccc2c(c1)[nH]c1c2c2C(=O)NC(=O)c2c2c3cccc4CNCCn(c34)c12
InChI Key: InChIKey=JRQGLWAUSPBBHJ-UHFFFAOYSA-N
Data: 3 IC50
Activity Spreadsheet -- Enzyme Inhibition Constant Data from BindingDB
Found 3 hits for monomerid = 6708
Trg + Lig
Ki
nM
ΔG°
kcal/mole
IC50
nM
Kd
nM
EC50/IC50
nM
koff
s-1
kon
M-1s-1
pHTemp
°C
Cyclin-Dependent Kinase 4 (CDK4)
(Homo sapiens (Human))
BDBM6708
(7-fluoro-1,4,14,24-tetraazaheptacyclo[16.8.1.0^{2,...)
Show SMILES Fc1ccc2c(c1)[nH]c1c2c2C(=O)NC(=O)c2c2c3cccc4CNCCn(c34)c12
Show InChI InChI=1S/C23H15FN4O2/c24-11-4-5-12-14(8-11)26-19-15(12)17-18(23(30)27-22(17)29)16-13-3-1-2-10-9-25-6-7-28(20(10)13)21(16)19/h1-5,8,25-26H,6-7,9H2,(H,27,29,30)
NCI pathway
Reactome pathway
n/an/a 31n/an/an/an/a7.022
Lilly Research Laboratories
Assay Description
In vitro CDK assay using purified enzyme, was incubated at room temperature with substrate, and test compounds in the presence of ATP/[gamma-33P]ATP....
Bioorg Med Chem Lett 14: 3925-8 (2004)
Article DOI: 10.1016/j.bmcl.2004.05.088
BindingDB Entry DOI: 10.7270/Q2TX3CKP
cAMP-Dependent Protein Kinase (PKA)
(Bos taurus (bovine))
BDBM6708
(7-fluoro-1,4,14,24-tetraazaheptacyclo[16.8.1.0^{2,...)
Show SMILES Fc1ccc2c(c1)[nH]c1c2c2C(=O)NC(=O)c2c2c3cccc4CNCCn(c34)c12
Show InChI InChI=1S/C23H15FN4O2/c24-11-4-5-12-14(8-11)26-19-15(12)17-18(23(30)27-22(17)29)16-13-3-1-2-10-9-25-6-7-28(20(10)13)21(16)19/h1-5,8,25-26H,6-7,9H2,(H,27,29,30)
n/an/a 430n/an/an/an/an/a25
Lilly Research Laboratories
Assay Description
In vitro kinase assay using purified enzyme, was incubated at room temperature with substrate, and test compounds in the presence of ATP/[gamma-33P]A...
Bioorg Med Chem Lett 14: 3925-8 (2004)
Article DOI: 10.1016/j.bmcl.2004.05.088
BindingDB Entry DOI: 10.7270/Q2TX3CKP
CDK2/CycE
(Homo sapiens (Human))
BDBM6708
(7-fluoro-1,4,14,24-tetraazaheptacyclo[16.8.1.0^{2,...)
Show SMILES Fc1ccc2c(c1)[nH]c1c2c2C(=O)NC(=O)c2c2c3cccc4CNCCn(c34)c12
Show InChI InChI=1S/C23H15FN4O2/c24-11-4-5-12-14(8-11)26-19-15(12)17-18(23(30)27-22(17)29)16-13-3-1-2-10-9-25-6-7-28(20(10)13)21(16)19/h1-5,8,25-26H,6-7,9H2,(H,27,29,30)
n/an/a 16n/an/an/an/an/a25
Lilly Research Laboratories
Assay Description
In vitro kinase assay using purified enzyme, was incubated at room temperature with substrate, and test compounds in the presence of ATP/[gamma-33P]A...
Bioorg Med Chem Lett 14: 3925-8 (2004)
Article DOI: 10.1016/j.bmcl.2004.05.088
BindingDB Entry DOI: 10.7270/Q2TX3CKP