BDBM6711 6-(hydroxymethyl)-7-(trifluoromethyl)-1,4,14,24-tetraazaheptacyclo[16.8.1.0^{2,17}.0^{3,11}.0^{5,10}.0^{12,16}.0^{22,27}]heptacosa-2(17),3(11),5(10),6,8,12(16),18(27),19,21-nonaene-13,15-dione hydrochloride::aza-1,7-annulated indole deriv. 12f
SMILES: OCc1c(ccc2c1[nH]c1c2c2C(=O)NC(=O)c2c2c3cccc4CNCCn(c34)c12)C(F)(F)F
InChI Key: InChIKey=OBRAUYHLVJPPJU-UHFFFAOYSA-N
Data: 1 IC50
Activity Spreadsheet -- Enzyme Inhibition Constant Data from BindingDB
Found 1 hit for monomerid = 6711
Trg + Lig
Ki
nM
ΔG°
kcal/mole
IC50
nM
Kd
nM
EC50/IC50
nM
koff
s-1
kon
M-1s-1
pHTemp
°C
Cyclin-Dependent Kinase 4 (CDK4)
(Homo sapiens (Human))
BDBM6711
(6-(hydroxymethyl)-7-(trifluoromethyl)-1,4,14,24-te...)
Show SMILES OCc1c(ccc2c1[nH]c1c2c2C(=O)NC(=O)c2c2c3cccc4CNCCn(c34)c12)C(F)(F)F
Show InChI InChI=1S/C25H17F3N4O3/c26-25(27,28)14-5-4-11-15-17-18(24(35)31-23(17)34)16-12-3-1-2-10-8-29-6-7-32(21(10)12)22(16)20(15)30-19(11)13(14)9-33/h1-5,29-30,33H,6-9H2,(H,31,34,35)
NCI pathway
Reactome pathway
n/an/a 44n/an/an/an/a7.022
Lilly Research Laboratories
Assay Description
In vitro CDK assay using purified enzyme, was incubated at room temperature with substrate, and test compounds in the presence of ATP/[gamma-33P]ATP....
Bioorg Med Chem Lett 14: 3925-8 (2004)
Article DOI: 10.1016/j.bmcl.2004.05.088
BindingDB Entry DOI: 10.7270/Q2TX3CKP