BDBM6737 1,7-Annulated indolocarbazole deriv. 16d::7-(piperidin-1-ylmethyl)-1,4,14-triazaheptacyclo[16.7.1.0^{2,17}.0^{3,11}.0^{5,10}.0^{12,16}.0^{22,26}]hexacosa-2(17),3(11),5(10),6,8,12(16),18(26),19,21-nonaene-13,15-dione
SMILES: O=C1NC(=O)c2c1c1c3ccc(CN4CCCCC4)cc3[nH]c1c1n3CCCc4cccc(c21)c34
InChI Key: InChIKey=CVZLVFZJEFTBFX-UHFFFAOYSA-N
Data: 1 IC50
Activity Spreadsheet -- Enzyme Inhibition Constant Data from BindingDB
Found 1 hit for monomerid = 6737
Trg + Lig
Ki
nM
ΔG°
kcal/mole
IC50
nM
Kd
nM
EC50/IC50
nM
koff
s-1
kon
M-1s-1
pHTemp
°C
Cyclin-Dependent Kinase 4 (CDK4)
(Homo sapiens (Human))
BDBM6737
(1,7-Annulated indolocarbazole deriv. 16d | 7-(pipe...)
Show SMILES O=C1NC(=O)c2c1c1c3ccc(CN4CCCCC4)cc3[nH]c1c1n3CCCc4cccc(c21)c34
Show InChI InChI=1S/C29H26N4O2/c34-28-23-21-18-10-9-16(15-32-11-2-1-3-12-32)14-20(18)30-25(21)27-22(24(23)29(35)31-28)19-8-4-6-17-7-5-13-33(27)26(17)19/h4,6,8-10,14,30H,1-3,5,7,11-13,15H2,(H,31,34,35)
NCI pathway
Reactome pathway
n/an/a 87n/an/an/an/a7.022
Lilly Research Laboratories
Assay Description
In vitro CDK assay using purified enzyme, was incubated at room temperature with substrate, and test compounds in the presence of ATP/[gamma-33P]ATP....
Bioorg Med Chem Lett 14: 3217-20 (2004)
Article DOI: 10.1016/j.bmcl.2004.03.105
BindingDB Entry DOI: 10.7270/Q2Q52MTT