BDBM6739 1,7-Annulated indolocarbazole deriv. 16f::7-(thiomorpholin-4-ylmethyl)-1,4,14-triazaheptacyclo[16.7.1.0^{2,17}.0^{3,11}.0^{5,10}.0^{12,16}.0^{22,26}]hexacosa-2(17),3(11),5(10),6,8,12(16),18(26),19,21-nonaene-13,15-dione
SMILES: O=C1NC(=O)c2c1c1c3ccc(CN4CCSCC4)cc3[nH]c1c1n3CCCc4cccc(c21)c34
InChI Key: InChIKey=CYKPPNRVHKJXHI-UHFFFAOYSA-N
Data: 1 IC50
Activity Spreadsheet -- Enzyme Inhibition Constant Data from BindingDB
Found 1 hit for monomerid = 6739
Trg + Lig
Ki
nM
ΔG°
kcal/mole
IC50
nM
Kd
nM
EC50/IC50
nM
koff
s-1
kon
M-1s-1
pHTemp
°C
Cyclin-dependent kinase 4/G1/S-specific cyclin-D1
(Homo sapiens (Human))
BDBM6739
(1,7-Annulated indolocarbazole deriv. 16f | 7-(thio...)
Show SMILES O=C1NC(=O)c2c1c1c3ccc(CN4CCSCC4)cc3[nH]c1c1n3CCCc4cccc(c21)c34
Show InChI InChI=1S/C28H24N4O2S/c33-27-22-20-17-7-6-15(14-31-9-11-35-12-10-31)13-19(17)29-24(20)26-21(23(22)28(34)30-27)18-5-1-3-16-4-2-8-32(26)25(16)18/h1,3,5-7,13,29H,2,4,8-12,14H2,(H,30,33,34)
NCI pathway
Reactome pathway
n/an/a 90n/an/an/an/a7.022
Lilly Research Laboratories
Assay Description
In vitro CDK assay using purified enzyme, was incubated at room temperature with substrate, and test compounds in the presence of ATP/[gamma-33P]ATP....
Bioorg Med Chem Lett 14: 3217-20 (2004)
Article DOI: 10.1016/j.bmcl.2004.03.105
BindingDB Entry DOI: 10.7270/Q2Q52MTT