BDBM6741 1,7-Annulated indolocarbazole deriv. 16h::7-(1,4-diazepan-1-ylmethyl)-1,4,14-triazaheptacyclo[16.7.1.0^{2,17}.0^{3,11}.0^{5,10}.0^{12,16}.0^{22,26}]hexacosa-2(17),3(11),5(10),6,8,12(16),18(26),19,21-nonaene-13,15-dione
SMILES: O=C1NC(=O)c2c1c1c3ccc(CN4CCCNCC4)cc3[nH]c1c1n3CCCc4cccc(c21)c34
InChI Key: InChIKey=DTUDWBDEBJDRRM-UHFFFAOYSA-N
Data: 1 IC50
Activity Spreadsheet -- Enzyme Inhibition Constant Data from BindingDB
Found 1 hit for monomerid = 6741
Trg + Lig
Ki
nM
ΔG°
kcal/mole
IC50
nM
Kd
nM
EC50/IC50
nM
koff
s-1
kon
M-1s-1
pHTemp
°C
Cyclin-dependent kinase 4/G1/S-specific cyclin-D1
(Homo sapiens (Human))
BDBM6741
(1,7-Annulated indolocarbazole deriv. 16h | 7-(1,4-...)
Show SMILES O=C1NC(=O)c2c1c1c3ccc(CN4CCCNCC4)cc3[nH]c1c1n3CCCc4cccc(c21)c34
Show InChI InChI=1S/C29H27N5O2/c35-28-23-21-18-8-7-16(15-33-11-3-9-30-10-13-33)14-20(18)31-25(21)27-22(24(23)29(36)32-28)19-6-1-4-17-5-2-12-34(27)26(17)19/h1,4,6-8,14,30-31H,2-3,5,9-13,15H2,(H,32,35,36)
NCI pathway
Reactome pathway
n/an/a 79n/an/an/an/a7.022
Lilly Research Laboratories
Assay Description
In vitro CDK assay using purified enzyme, was incubated at room temperature with substrate, and test compounds in the presence of ATP/[gamma-33P]ATP....
Bioorg Med Chem Lett 14: 3217-20 (2004)
Article DOI: 10.1016/j.bmcl.2004.03.105
BindingDB Entry DOI: 10.7270/Q2Q52MTT