BDBM67675 CHEMBL1543343::MLS001221673::N-[2-(3-keto-4H-quinoxalin-2-yl)phenyl]thiophene-2-carboxamide::N-[2-(3-oxidanylidene-4H-quinoxalin-2-yl)phenyl]thiophene-2-carboxamide::N-[2-(3-oxo-4H-quinoxalin-2-yl)phenyl]-2-thiophenecarboxamide::N-[2-(3-oxo-4H-quinoxalin-2-yl)phenyl]thiophene-2-carboxamide::SMR000613241::Thiophene-2-carboxylic acid [2-(3-oxo-3,4-dihydro-quinoxalin-2-yl)-phenyl]-amide::cid_3162043
SMILES: O=C(Nc1ccccc1-c1nc2ccccc2[nH]c1=O)c1cccs1
InChI Key: InChIKey=QSVBKTQBVIMRBD-UHFFFAOYSA-N
Data: 1 IC50  1 EC50
Activity Spreadsheet -- Enzyme Inhibition Constant Data from BindingDB
Found 2 hits for monomerid = 67675
Trg + Lig
Ki
nM
ΔG°
kcal/mole
IC50
nM
Kd
nM
EC50/IC50
nM
koff
s-1
kon
M-1s-1
pHTemp
°C
Serine/threonine-protein kinase 33
(Homo sapiens (Human))
BDBM67675
(CHEMBL1543343 | MLS001221673 | N-[2-(3-keto-4H-qui...)
Show SMILES O=C(Nc1ccccc1-c1nc2ccccc2[nH]c1=O)c1cccs1
Show InChI InChI=1S/C19H13N3O2S/c23-18(16-10-5-11-25-16)21-13-7-2-1-6-12(13)17-19(24)22-15-9-4-3-8-14(15)20-17/h1-11H,(H,21,23)(H,22,24)
n/an/a 280n/an/an/an/an/an/a
TBA
Curated by ChEMBL
Assay Description
Inhibition of N-terminal 6His-tagged full length human recombinant STK33 using myelin basic protein as substrate incubated for 15 mins before initiat...
ACS Med Chem Lett 3: 1034-1038 (2012)
Article DOI: 10.1021/ml300246r
BindingDB Entry DOI: 10.7270/Q2PK0H9X
Serine/threonine-protein kinase 33
(Homo sapiens (Human))
BDBM67675
(CHEMBL1543343 | MLS001221673 | N-[2-(3-keto-4H-qui...)
Show SMILES O=C(Nc1ccccc1-c1nc2ccccc2[nH]c1=O)c1cccs1
Show InChI InChI=1S/C19H13N3O2S/c23-18(16-10-5-11-25-16)21-13-7-2-1-6-12(13)17-19(24)22-15-9-4-3-8-14(15)20-17/h1-11H,(H,21,23)(H,22,24)
PCBioAssay
n/an/an/an/a 2.10E+3n/an/an/an/a
Broad Institute
Curated by PubChem BioAssay
Assay Description
Keywords: STK33 Kinase, Non-ATP Competitive Inhibitor Assay Overview: Purified STK33 Kinase is preincubated with potential inhibitors and allowed to ...
PubChem Bioassay (2010)
BindingDB Entry DOI: 10.7270/Q2B27SRF