BDBM67935 2,6-dimethyl-4-[(E)-2-phenylethenyl]-1,4-dihydropyridine-3,5-dicarboxylic acid diethyl ester::2,6-dimethyl-4-[(E)-styryl]-1,4-dihydropyridine-3,5-dicarboxylic acid diethyl ester::CHEMBL142868::MLS000571350::SMR000193435::cid_980118::diethyl 2,6-dimethyl-4-(2-phenylvinyl)-1,4-dihydro-3,5-pyridinedicarboxylate::diethyl 2,6-dimethyl-4-[(E)-2-phenylethenyl]-1,4-dihydropyridine-3,5-dicarboxylate
SMILES: CCOC(=O)C1C(\C=C\c2ccccc2)C(C(=O)OCC)=C(C)N=C1C
InChI Key: InChIKey=UJPAOKAXEKZRNI-OUKQBFOZSA-N
Data: 3 KI  3 IC50
Activity Spreadsheet -- Enzyme Inhibition Constant Data from BindingDB
Found 6 hits for monomerid = 67935
Trg + Lig
Ki
nM
ΔG°
kcal/mole
IC50
nM
Kd
nM
EC50/IC50
nM
koff
s-1
kon
M-1s-1
pHTemp
°C
Adenosine receptor A3
(Homo sapiens (Human))
BDBM67935
(2,6-dimethyl-4-[(E)-2-phenylethenyl]-1,4-dihydropy...)
Show SMILES CCOC(=O)C1C(\C=C\c2ccccc2)C(C(=O)OCC)=C(C)N=C1C |c:24,t:21|
Show InChI InChI=1S/C21H25NO4/c1-5-25-20(23)18-14(3)22-15(4)19(21(24)26-6-2)17(18)13-12-16-10-8-7-9-11-16/h7-13,17-18H,5-6H2,1-4H3/b13-12+
Reactome pathway
887n/an/an/an/an/an/an/an/a
National Institute of Diabetes
Curated by ChEMBL
Assay Description
Binding affinity against cloned human adenosine A3 receptor by radioligand binding assay using [125I]-AB-MECA.
J Med Chem 39: 4667-75 (1996)
Article DOI: 10.1021/jm960457c
BindingDB Entry DOI: 10.7270/Q2VQ33BG
Adenosine receptor A1
(Rattus norvegicus (rat))
BDBM67935
(2,6-dimethyl-4-[(E)-2-phenylethenyl]-1,4-dihydropy...)
Show SMILES CCOC(=O)C1C(\C=C\c2ccccc2)C(C(=O)OCC)=C(C)N=C1C |c:24,t:21|
Show InChI InChI=1S/C21H25NO4/c1-5-25-20(23)18-14(3)22-15(4)19(21(24)26-6-2)17(18)13-12-16-10-8-7-9-11-16/h7-13,17-18H,5-6H2,1-4H3/b13-12+
Reactome pathway
4.65E+3n/an/an/an/an/an/an/an/a
National Institute of Diabetes
Curated by ChEMBL
Assay Description
Binding affinity against adenosine A1 receptor in rat cerebral cortex membrane by radioligand binding assay using [3H](R)-PIA.
J Med Chem 39: 4667-75 (1996)
Article DOI: 10.1021/jm960457c
BindingDB Entry DOI: 10.7270/Q2VQ33BG
Adenosine Receptors A2a (A2a)
(Rattus norvegicus (rat))
BDBM67935
(2,6-dimethyl-4-[(E)-2-phenylethenyl]-1,4-dihydropy...)
Show SMILES CCOC(=O)C1C(\C=C\c2ccccc2)C(C(=O)OCC)=C(C)N=C1C |c:24,t:21|
Show InChI InChI=1S/C21H25NO4/c1-5-25-20(23)18-14(3)22-15(4)19(21(24)26-6-2)17(18)13-12-16-10-8-7-9-11-16/h7-13,17-18H,5-6H2,1-4H3/b13-12+
Reactome pathway
9.23E+3n/an/an/an/an/an/an/an/a
National Institute of Diabetes
Curated by ChEMBL
Assay Description
Displacement of [3H]-CGS- 21680 from Adenosine A2A receptor of rat striatal membrane
J Med Chem 39: 4667-75 (1996)
Article DOI: 10.1021/jm960457c
BindingDB Entry DOI: 10.7270/Q2VQ33BG
XBP1
(Homo sapiens (Human))
BDBM67935
(2,6-dimethyl-4-[(E)-2-phenylethenyl]-1,4-dihydropy...)
Show SMILES CCOC(=O)C1C(\C=C\c2ccccc2)C(C(=O)OCC)=C(C)N=C1C |c:24,t:21|
Show InChI InChI=1S/C21H25NO4/c1-5-25-20(23)18-14(3)22-15(4)19(21(24)26-6-2)17(18)13-12-16-10-8-7-9-11-16/h7-13,17-18H,5-6H2,1-4H3/b13-12+
PCBioAssay
n/an/a 7.68E+3n/an/an/an/an/an/a
Emory University Molecular Libraries Screening Center
Curated by PubChem BioAssay
Assay Description
NIH Molecular Libraries Screening Centers Network [MLSCN] Emory Chemical Biology Discovery Center in MLSCN Assay provider: Dr. Randal Kaufman, Univer...
PubChem Bioassay (2011)
BindingDB Entry DOI: 10.7270/Q2NK3CGB
DNA damage-inducible transcript 3 protein
(Mus musculus)
BDBM67935
(2,6-dimethyl-4-[(E)-2-phenylethenyl]-1,4-dihydropy...)
Show SMILES CCOC(=O)C1C(\C=C\c2ccccc2)C(C(=O)OCC)=C(C)N=C1C |c:24,t:21|
Show InChI InChI=1S/C21H25NO4/c1-5-25-20(23)18-14(3)22-15(4)19(21(24)26-6-2)17(18)13-12-16-10-8-7-9-11-16/h7-13,17-18H,5-6H2,1-4H3/b13-12+
PCBioAssay
n/an/a>1.00E+4n/an/an/an/an/an/a
Emory University Molecular Libraries Screening Center
Curated by PubChem BioAssay
Assay Description
NIH Molecular Libraries Screening Centers Network [MLSCN] Emory Chemical Biology Discovery Center in MLSCN Assay provider: Dr. Randal Kaufman, Univer...
PubChem Bioassay (2010)
BindingDB Entry DOI: 10.7270/Q2PC30VZ
DNA damage-inducible transcript 3 protein
(Mus musculus)
BDBM67935
(2,6-dimethyl-4-[(E)-2-phenylethenyl]-1,4-dihydropy...)
Show SMILES CCOC(=O)C1C(\C=C\c2ccccc2)C(C(=O)OCC)=C(C)N=C1C |c:24,t:21|
Show InChI InChI=1S/C21H25NO4/c1-5-25-20(23)18-14(3)22-15(4)19(21(24)26-6-2)17(18)13-12-16-10-8-7-9-11-16/h7-13,17-18H,5-6H2,1-4H3/b13-12+
PCBioAssay
n/an/a>1.00E+4n/an/an/an/an/an/a
Emory University Molecular Libraries Screening Center
Curated by PubChem BioAssay
Assay Description
NIH Molecular Libraries Screening Centers Network [MLSCN] Emory Chemical Biology Discovery Center in MLSCN Assay provider: Dr. Randal Kaufman, Univer...
PubChem Bioassay (2011)
BindingDB Entry DOI: 10.7270/Q28C9TQN