BDBM6800 6-hydroxy-3,13,18-triazahexacyclo[14.7.0.0^{2,10}.0^{4,9}.0^{11,15}.0^{17,21}]tricosa-1(16),2(10),4(9),5,7,11(15),17(21),19,22-nonaene-12,14-dione::indolo[6,7-a]pyrrolo[3,4-c]carbazole deriv. 3s
SMILES: Oc1ccc2c(c1)[nH]c1c2c2C(=O)NC(=O)c2c2c3[nH]ccc3ccc12
InChI Key: InChIKey=PHEMXOLLNFYYLK-UHFFFAOYSA-N
Data: 4 IC50
Activity Spreadsheet -- Enzyme Inhibition Constant Data from BindingDB
Found 4 hits for monomerid = 6800
Trg + Lig
Ki
nM
ΔG°
kcal/mole
IC50
nM
Kd
nM
EC50/IC50
nM
koff
s-1
kon
M-1s-1
pHTemp
°C
Cyclin-Dependent Kinase 4 (CDK4)
(Homo sapiens (Human))
BDBM6800
(6-hydroxy-3,13,18-triazahexacyclo[14.7.0.0^{2,10}....)
Show SMILES Oc1ccc2c(c1)[nH]c1c2c2C(=O)NC(=O)c2c2c3[nH]ccc3ccc12
Show InChI InChI=1S/C20H11N3O3/c24-9-2-4-10-12(7-9)22-18-11-3-1-8-5-6-21-17(8)14(11)16-15(13(10)18)19(25)23-20(16)26/h1-7,21-22,24H,(H,23,25,26)
NCI pathway
Reactome pathway
n/an/a 37n/an/an/an/an/a25
Lilly Research Laboratories
Assay Description
In vitro CDK assay using purified enzyme, was incubated at room temperature with substrate, and test compounds in the presence of ATP/[gamma-33P]ATP....
Bioorg Med Chem Lett 13: 2261-7 (2003)
Article DOI: 10.1016/s0960-894x(03)00461-x
BindingDB Entry DOI: 10.7270/Q29W0CPW
cAMP-Dependent Protein Kinase (PKA)
(Bos taurus (bovine))
BDBM6800
(6-hydroxy-3,13,18-triazahexacyclo[14.7.0.0^{2,10}....)
Show SMILES Oc1ccc2c(c1)[nH]c1c2c2C(=O)NC(=O)c2c2c3[nH]ccc3ccc12
Show InChI InChI=1S/C20H11N3O3/c24-9-2-4-10-12(7-9)22-18-11-3-1-8-5-6-21-17(8)14(11)16-15(13(10)18)19(25)23-20(16)26/h1-7,21-22,24H,(H,23,25,26)
n/an/a 949n/an/an/an/an/a25
Lilly Research Laboratories
Assay Description
In vitro kinase assay using purified enzyme, was incubated at room temperature with substrate, and test compounds in the presence of ATP/[gamma-33P]A...
Bioorg Med Chem Lett 13: 2261-7 (2003)
Article DOI: 10.1016/s0960-894x(03)00461-x
BindingDB Entry DOI: 10.7270/Q29W0CPW
CDK2/CycE
(Homo sapiens (Human))
BDBM6800
(6-hydroxy-3,13,18-triazahexacyclo[14.7.0.0^{2,10}....)
Show SMILES Oc1ccc2c(c1)[nH]c1c2c2C(=O)NC(=O)c2c2c3[nH]ccc3ccc12
Show InChI InChI=1S/C20H11N3O3/c24-9-2-4-10-12(7-9)22-18-11-3-1-8-5-6-21-17(8)14(11)16-15(13(10)18)19(25)23-20(16)26/h1-7,21-22,24H,(H,23,25,26)
n/an/a 6n/an/an/an/an/a25
Lilly Research Laboratories
Assay Description
In vitro CDK assay using purified enzyme, was incubated at room temperature with substrate, and test compounds in the presence of ATP/[gamma-33P]ATP....
Bioorg Med Chem Lett 13: 2261-7 (2003)
Article DOI: 10.1016/s0960-894x(03)00461-x
BindingDB Entry DOI: 10.7270/Q29W0CPW
Cyclin-Dependent Kinase 4 (CDK4)
(Homo sapiens (Human))
BDBM6800
(6-hydroxy-3,13,18-triazahexacyclo[14.7.0.0^{2,10}....)
Show SMILES Oc1ccc2c(c1)[nH]c1c2c2C(=O)NC(=O)c2c2c3[nH]ccc3ccc12
Show InChI InChI=1S/C20H11N3O3/c24-9-2-4-10-12(7-9)22-18-11-3-1-8-5-6-21-17(8)14(11)16-15(13(10)18)19(25)23-20(16)26/h1-7,21-22,24H,(H,23,25,26)
NCI pathway
Reactome pathway
n/an/a 17n/an/an/an/an/a25
Lilly Research Laboratories
Assay Description
In vitro CDK assay using purified enzyme, was incubated at room temperature with substrate, and test compounds in the presence of ATP/[gamma-33P]ATP....
Bioorg Med Chem Lett 13: 2261-7 (2003)
Article DOI: 10.1016/s0960-894x(03)00461-x
BindingDB Entry DOI: 10.7270/Q29W0CPW