BDBM6855 6-(trifluoromethyl)-3,13,23-triazahexacyclo[14.7.0.0^{2,10}.0^{4,9}.0^{11,15}.0^{17,22}]tricosa-1(16),2(10),4(9),5,7,11(15),17(22),18,20-nonaene-12,14-dione::Indolocarbazole deriv. 4k
SMILES: FC(F)(F)c1ccc2c(c1)[nH]c1c3[nH]c4ccccc4c3c3C(=O)NC(=O)c3c21
InChI Key: InChIKey=WMGQBOOUMYHZOR-UHFFFAOYSA-N
Data: 4 IC50
Activity Spreadsheet -- Enzyme Inhibition Constant Data from BindingDB
Found 4 hits for monomerid = 6855
Trg + Lig
Ki
nM
ΔG°
kcal/mole
IC50
nM
Kd
nM
EC50/IC50
nM
koff
s-1
kon
M-1s-1
pHTemp
°C
Cyclin-Dependent Kinase 4 (CDK4)
(Homo sapiens (Human))
BDBM6855
(6-(trifluoromethyl)-3,13,23-triazahexacyclo[14.7.0...)
Show SMILES FC(F)(F)c1ccc2c(c1)[nH]c1c3[nH]c4ccccc4c3c3C(=O)NC(=O)c3c21
Show InChI InChI=1S/C21H10F3N3O2/c22-21(23,24)8-5-6-10-12(7-8)26-18-14(10)16-15(19(28)27-20(16)29)13-9-3-1-2-4-11(9)25-17(13)18/h1-7,25-26H,(H,27,28,29)
NCI pathway
Reactome pathway
n/an/a 1.14E+3n/an/an/an/a7.022
Lilly Research Laboratories
Assay Description
In vitro kinase assay using purified enzyme, was incubated at room temperature with substrate, and test compounds in the presence of ATP/[gamma-33P]A...
J Med Chem 46: 2027-30 (2003)
Article DOI: 10.1021/jm0256169
BindingDB Entry DOI: 10.7270/Q2668BCN
cAMP-Dependent Protein Kinase (PKA)
(Bos taurus (bovine))
BDBM6855
(6-(trifluoromethyl)-3,13,23-triazahexacyclo[14.7.0...)
Show SMILES FC(F)(F)c1ccc2c(c1)[nH]c1c3[nH]c4ccccc4c3c3C(=O)NC(=O)c3c21
Show InChI InChI=1S/C21H10F3N3O2/c22-21(23,24)8-5-6-10-12(7-8)26-18-14(10)16-15(19(28)27-20(16)29)13-9-3-1-2-4-11(9)25-17(13)18/h1-7,25-26H,(H,27,28,29)
n/an/a>2.00E+3n/an/an/an/an/a25
Lilly Research Laboratories
Assay Description
In vitro kinase assay using purified enzyme, was incubated at room temperature with substrate, and test compounds in the presence of ATP/[gamma-33P]A...
J Med Chem 46: 2027-30 (2003)
Article DOI: 10.1021/jm0256169
BindingDB Entry DOI: 10.7270/Q2668BCN
CaM Kinase II
(Rattus norvegicus (rat))
BDBM6855
(6-(trifluoromethyl)-3,13,23-triazahexacyclo[14.7.0...)
Show SMILES FC(F)(F)c1ccc2c(c1)[nH]c1c3[nH]c4ccccc4c3c3C(=O)NC(=O)c3c21
Show InChI InChI=1S/C21H10F3N3O2/c22-21(23,24)8-5-6-10-12(7-8)26-18-14(10)16-15(19(28)27-20(16)29)13-9-3-1-2-4-11(9)25-17(13)18/h1-7,25-26H,(H,27,28,29)
n/an/a>2.00E+3n/an/an/an/an/a25
Lilly Research Laboratories
Assay Description
In vitro kinase assay using purified enzyme, was incubated at room temperature with substrate, and test compounds in the presence of ATP/[gamma-33P]A...
J Med Chem 46: 2027-30 (2003)
Article DOI: 10.1021/jm0256169
BindingDB Entry DOI: 10.7270/Q2668BCN
CDK2/CycE
(Homo sapiens (Human))
BDBM6855
(6-(trifluoromethyl)-3,13,23-triazahexacyclo[14.7.0...)
Show SMILES FC(F)(F)c1ccc2c(c1)[nH]c1c3[nH]c4ccccc4c3c3C(=O)NC(=O)c3c21
Show InChI InChI=1S/C21H10F3N3O2/c22-21(23,24)8-5-6-10-12(7-8)26-18-14(10)16-15(19(28)27-20(16)29)13-9-3-1-2-4-11(9)25-17(13)18/h1-7,25-26H,(H,27,28,29)
n/an/a>2.00E+3n/an/an/an/an/a25
Lilly Research Laboratories
Assay Description
In vitro kinase assay using purified enzyme, was incubated at room temperature with substrate, and test compounds in the presence of ATP/[gamma-33P]A...
J Med Chem 46: 2027-30 (2003)
Article DOI: 10.1021/jm0256169
BindingDB Entry DOI: 10.7270/Q2668BCN