BDBM70212 3-[3-(4-tert-butylphenyl)-1,2,4-oxadiazol-5-yl]-N-(4-ethoxyphenyl)propanamide::3-[3-(4-tert-butylphenyl)-1,2,4-oxadiazol-5-yl]-N-p-phenetyl-propionamide::SR-03000001329::SR-03000001329-1::cid_1249379
SMILES: CCOc1ccc(NC(=O)CCc2nc(no2)-c2ccc(cc2)C(C)(C)C)cc1
InChI Key: InChIKey=SVPZTPZZHQCNJJ-UHFFFAOYSA-N
Data: 1 IC50
Activity Spreadsheet -- Enzyme Inhibition Constant Data from BindingDB
Found 1 hit for monomerid = 70212
Trg + Lig
Ki
nM
ΔG°
kcal/mole
IC50
nM
Kd
nM
EC50/IC50
nM
koff
s-1
kon
M-1s-1
pHTemp
°C
Kruppel-like factor 5
(Homo sapiens (Human))
BDBM70212
(3-[3-(4-tert-butylphenyl)-1,2,4-oxadiazol-5-yl]-N-...)
Show SMILES CCOc1ccc(NC(=O)CCc2nc(no2)-c2ccc(cc2)C(C)(C)C)cc1
Show InChI InChI=1S/C23H27N3O3/c1-5-28-19-12-10-18(11-13-19)24-20(27)14-15-21-25-22(26-29-21)16-6-8-17(9-7-16)23(2,3)4/h6-13H,5,14-15H2,1-4H3,(H,24,27)
Reactome pathway
PCBioAssay
n/an/a 285n/an/an/an/an/an/a
The Scripps Research Institute Molecular Screening Center
Curated by PubChem BioAssay
Assay Description
Source (MLPCN Center Name): The Scripps Research Institute Molecular Screening Center Affiliation: The Scripps Research Institute, TSRI Assay Provide...
PubChem Bioassay (2010)
BindingDB Entry DOI: 10.7270/Q2Q52N2C