BDBM7027 (4R,5S,6S,7R)-4,7-bis(2,3-dihydro-1,4-benzodioxin-6-ylmethyl)-1,3-bis[(3-acetyl-4-fluorophenyl)methyl]-5,6-dihydroxy-1,3-diazepan-2-one::(4R,5S,6S,7R)-Hexahydro-5,6-dihydroxy-1,3-bis(3-acetyl-4-fluorobenzyl)-4,7-bis((3,4-(ethylenedioxy)phenyl)methyl)2H-1,3-diazapin-2-one::Cyclic Urea Based HIV-1 Protease Inhibitor 29
SMILES: CC(=O)c1cc(CN2[C@H](Cc3ccc4OCCOc4c3)[C@H](O)[C@@H](O)[C@@H](Cc3ccc4OCCOc4c3)N(Cc3ccc(F)c(c3)C(C)=O)C2=O)ccc1F
InChI Key: InChIKey=YHKWCKXVLPYUKQ-HVPIWBAOSA-N
Data: 1 KI
Activity Spreadsheet -- Enzyme Inhibition Constant Data from BindingDB
Found 1 hit for monomerid = 7027
Trg + Lig
Ki
nM
ΔG°
kcal/mole
IC50
nM
Kd
nM
EC50/IC50
nM
koff
s-1
kon
M-1s-1
pHTemp
°C
HIV-1 Protease
(Human immunodeficiency virus type 1)
BDBM7027
((4R,5S,6S,7R)-4,7-bis(2,3-dihydro-1,4-benzodioxin-...)
Show SMILES CC(=O)c1cc(CN2[C@H](Cc3ccc4OCCOc4c3)[C@H](O)[C@@H](O)[C@@H](Cc3ccc4OCCOc4c3)N(Cc3ccc(F)c(c3)C(C)=O)C2=O)ccc1F
Show InChI InChI=1S/C41H40F2N2O9/c1-23(46)29-15-27(3-7-31(29)42)21-44-33(17-25-5-9-35-37(19-25)53-13-11-51-35)39(48)40(49)34(18-26-6-10-36-38(20-26)54-14-12-52-36)45(41(44)50)22-28-4-8-32(43)30(16-28)24(2)47/h3-10,15-16,19-20,33-34,39-40,48-49H,11-14,17-18,21-22H2,1-2H3/t33-,34-,39+,40+/m1/s1
0.640 -13.0n/an/an/an/an/a5.537
DuPont Merck Pharmaceutical Company
Assay Description
Inhibition of HIV protease was measured by assay of the cleavage of a fluorescent peptide substrate. The fluorescent product (2-aminobenzoyl-Ala-Thr-...
J Med Chem 40: 1465-74 (1997)
Article DOI: 10.1021/jm960839i
BindingDB Entry DOI: 10.7270/Q29021Z4