null
SMILES: COc1cc(ccc1S(=O)(=O)NC1CCN(CC1)C(=O)OC(C)(C)C)-c1c(Cl)cc(Nc2n[nH]c(N)n2)cc1C(F)(F)F
InChI Key: InChIKey=CEZRBSPFIFQZDO-UHFFFAOYSA-N
Activity Spreadsheet -- Enzyme Inhibition Constant Data from BindingDB
Found 1 hit for monomerid = 70633
Trg + Lig
Ki
nM
ΔG°
kcal/mole
IC50
nM
Kd
nM
EC50/IC50
nM
koff
s-1
kon
M-1s-1
pHTemp
°C
Genome polyprotein
(Hepatitis C virus (HCV genotype 1a, isolate H))
BDBM70633
(US9693997, 163)
Show SMILES COc1cc(ccc1S(=O)(=O)NC1CCN(CC1)C(=O)OC(C)(C)C)-c1c(Cl)cc(Nc2n[nH]c(N)n2)cc1C(F)(F)F |$;;;;;;;;;;;HN;;;;;;;;;;;;;;;;;;;HN;;;;;;;;;;;;$|
Show InChI InChI=1S/C26H31ClF3N7O5S/c1-25(2,3)42-24(38)37-9-7-15(8-10-37)36-43(39,40)20-6-5-14(11-19(20)41-4)21-17(26(28,29)30)12-16(13-18(21)27)32-23-33-22(31)34-35-23/h5-6,11-13,15,36H,7-10H2,1-4H3,(H4,31,32,33,34,35)
US Patent
n/an/an/an/a 5n/an/an/an/a
HOFFMANN-LA ROCHE INC.
US Patent
Assay Description
Plasmids expressing HCV E1 and E2 envelope proteins of GT1a H77 strain (Proc Natl Acad Sci USA 1997 94:8738-43) or GT1b Con1 strain (Science 1999 285...
US Patent US9693997 (2017)
BindingDB Entry DOI: 10.7270/Q2833Q56