BDBM7082 N-(1H-1,3-benzodiazol-2-yl)-3-{[(4R,5S,6S,7R)-3-{[3-(1H-1,3-benzodiazol-2-ylcarbamoyl)phenyl]methyl}-4,7-dihexyl-5,6-dihydroxy-2-oxo-1,3-diazepan-1-yl]methyl}benzamide::SD146 Analog 3
SMILES: CCCCCC[C@@H]1[C@H](O)[C@@H](O)[C@@H](CCCCCC)N(Cc2cccc(c2)C(=O)Nc2nc3ccccc3[nH]2)C(=O)N1Cc1cccc(c1)C(=O)Nc1nc2ccccc2[nH]1
InChI Key: InChIKey=IUVJUTKIAUWSDH-GLGKVNTQSA-N
Data: 1 KI
PDB links: 2 PDB IDs contain inhibitors having a similarity of 90% to this monomer.
Activity Spreadsheet -- Enzyme Inhibition Constant Data from BindingDB
Found 1 hit for monomerid = 7082
Trg + Lig
Ki
nM
ΔG°
kcal/mole
IC50
nM
Kd
nM
EC50/IC50
nM
koff
s-1
kon
M-1s-1
pHTemp
°C
HIV-1 Protease
(Human immunodeficiency virus type 1)
BDBM7082
(N-(1H-1,3-benzodiazol-2-yl)-3-{[(4R,5S,6S,7R)-3-{[...)
Show SMILES CCCCCC[C@@H]1[C@H](O)[C@@H](O)[C@@H](CCCCCC)N(Cc2cccc(c2)C(=O)Nc2nc3ccccc3[nH]2)C(=O)N1Cc1cccc(c1)C(=O)Nc1nc2ccccc2[nH]1
Show InChI InChI=1S/C47H56N8O5/c1-3-5-7-9-25-39-41(56)42(57)40(26-10-8-6-4-2)55(30-32-18-16-20-34(28-32)44(59)53-46-50-37-23-13-14-24-38(37)51-46)47(60)54(39)29-31-17-15-19-33(27-31)43(58)52-45-48-35-21-11-12-22-36(35)49-45/h11-24,27-28,39-42,56-57H,3-10,25-26,29-30H2,1-2H3,(H2,48,49,52,58)(H2,50,51,53,59)/t39-,40-,41+,42+/m1/s1
0.350 -13.4n/an/an/an/an/a5.537
DuPont Merck Pharmaceutical Company
Assay Description
Inhibition of HIV protease was measured by assay of the cleavage of a fluorescent peptide substrate. The fluorescent product (2-aminobenzoyl-Ala-Thr-...
Bioorg Med Chem Lett 8: 1077-82 (1998)
Article DOI: 10.1016/s0960-894x(98)00175-9
BindingDB Entry DOI: 10.7270/Q21G0JGN