BDBM7089 N-(1H-1,3-benzodiazol-2-yl)-3-{[(4R,5S,6S,7R)-3-{[3-(1H-1,3-benzodiazol-2-ylcarbamoyl)phenyl]methyl}-7-benzyl-4-ethyl-5,6-dihydroxy-2-oxo-1,3-diazepan-1-yl]methyl}benzamide::SD146 Analog 10
SMILES: CC[C@@H]1[C@H](O)[C@@H](O)[C@@H](Cc2ccccc2)N(Cc2cccc(c2)C(=O)Nc2nc3ccccc3[nH]2)C(=O)N1Cc1cccc(c1)C(=O)Nc1nc2ccccc2[nH]1
InChI Key: InChIKey=WWYHZIBXQFYYRM-AJWAGCPHSA-N
Data: 1 KI
PDB links: 2 PDB IDs contain inhibitors having a similarity of 90% to this monomer.
Activity Spreadsheet -- Enzyme Inhibition Constant Data from BindingDB
Found 1 hit for monomerid = 7089
Trg + Lig
Ki
nM
ΔG°
kcal/mole
IC50
nM
Kd
nM
EC50/IC50
nM
koff
s-1
kon
M-1s-1
pHTemp
°C
HIV-1 Protease
(Human immunodeficiency virus type 1)
BDBM7089
(N-(1H-1,3-benzodiazol-2-yl)-3-{[(4R,5S,6S,7R)-3-{[...)
Show SMILES CC[C@@H]1[C@H](O)[C@@H](O)[C@@H](Cc2ccccc2)N(Cc2cccc(c2)C(=O)Nc2nc3ccccc3[nH]2)C(=O)N1Cc1cccc(c1)C(=O)Nc1nc2ccccc2[nH]1
Show InChI InChI=1S/C44H42N8O5/c1-2-36-38(53)39(54)37(24-27-12-4-3-5-13-27)52(26-29-15-11-17-31(23-29)41(56)50-43-47-34-20-8-9-21-35(34)48-43)44(57)51(36)25-28-14-10-16-30(22-28)40(55)49-42-45-32-18-6-7-19-33(32)46-42/h3-23,36-39,53-54H,2,24-26H2,1H3,(H2,45,46,49,55)(H2,47,48,50,56)/t36-,37-,38+,39+/m1/s1
0.0690 -14.4n/an/an/an/an/a5.537
DuPont Merck Pharmaceutical Company
Assay Description
Inhibition of HIV protease was measured by assay of the cleavage of a fluorescent peptide substrate. The fluorescent product (2-aminobenzoyl-Ala-Thr-...
Bioorg Med Chem Lett 8: 1077-82 (1998)
Article DOI: 10.1016/s0960-894x(98)00175-9
BindingDB Entry DOI: 10.7270/Q21G0JGN