BDBM71192 US9546164, 299::US9694002, 299
SMILES: CS(=O)(=O)NC(=O)c1cc(C2CC2)c(OCC2CCN(CC2)C(c2cc(Cl)cc(Cl)c2)C(F)(F)F)cc1F
InChI Key: InChIKey=XLXIPEOIRIBHSV-UHFFFAOYSA-N
Data: 2 IC50
Activity Spreadsheet -- Enzyme Inhibition Constant Data from BindingDB
Found 2 hits for monomerid = 71192
Trg + Lig
Ki
nM
ΔG°
kcal/mole
IC50
nM
Kd
nM
EC50/IC50
nM
koff
s-1
kon
M-1s-1
pHTemp
°C
Sodium channel protein type 5 subunit alpha
(Homo sapiens (Human))
BDBM71192
(US9546164, 299 | US9694002, 299)
Show SMILES CS(=O)(=O)NC(=O)c1cc(C2CC2)c(OCC2CCN(CC2)C(c2cc(Cl)cc(Cl)c2)C(F)(F)F)cc1F
Show InChI InChI=1S/C25H26Cl2F4N2O4S/c1-38(35,36)32-24(34)20-11-19(15-2-3-15)22(12-21(20)28)37-13-14-4-6-33(7-5-14)23(25(29,30)31)16-8-17(26)10-18(27)9-16/h8-12,14-15,23H,2-7,13H2,1H3,(H,32,34)
US Patent
n/an/a 1.90n/an/an/an/a7.425
GENENTECH, INC.; XENON PHARMACEUTICALS INC.
US Patent
Assay Description
Radioligand Binding Studies: Saturation experiments. A representative compound of formula (I) having a methyl group was tritiated. Three tritiums wer...
US Patent US9546164 (2017)
BindingDB Entry DOI: 10.7270/Q2JD4ZS4
Sodium Channel Complex
(Homo sapiens (Human))
BDBM71192
(US9546164, 299 | US9694002, 299)
Show SMILES CS(=O)(=O)NC(=O)c1cc(C2CC2)c(OCC2CCN(CC2)C(c2cc(Cl)cc(Cl)c2)C(F)(F)F)cc1F
Show InChI InChI=1S/C25H26Cl2F4N2O4S/c1-38(35,36)32-24(34)20-11-19(15-2-3-15)22(12-21(20)28)37-13-14-4-6-33(7-5-14)23(25(29,30)31)16-8-17(26)10-18(27)9-16/h8-12,14-15,23H,2-7,13H2,1H3,(H,32,34)
US Patent
n/an/a 1.90n/an/an/an/a7.425
GENENTECH, INC.; XENON PHARMACEUTICALS INC.
US Patent
Assay Description
Binding of this radioligand was preformed in 5 mL borosilicate glass test tubes at room temperature. Binding was initiated by adding membranes to inc...
US Patent US9694002 (2017)
BindingDB Entry DOI: 10.7270/Q24B2ZFG