null
SMILES: CC(C(=O)Nc1cc(n[nH]1)C1CC1)c1ccc(cc1)N1CCCS1(=O)=O
InChI Key: InChIKey=RLTFKHPSPUGIRA-UHFFFAOYSA-N
Activity Spreadsheet -- Enzyme Inhibition Constant Data from BindingDB
Found 1 hit for monomerid = 7121
Trg + Lig
Ki
nM
ΔG°
kcal/mole
IC50
nM
Kd
nM
EC50/IC50
nM
koff
s-1
kon
M-1s-1
pHTemp
°C
Cyclin-A2/Cyclin-dependent kinase 2
(Homo sapiens (Human))
BDBM7121
(3-Aminopyrazole deriv. 36 | N-(5-Cyclopropyl-1H-py...)
Show SMILES CC(C(=O)Nc1cc(n[nH]1)C1CC1)c1ccc(cc1)N1CCCS1(=O)=O
Show InChI InChI=1S/C18H22N4O3S/c1-12(18(23)19-17-11-16(20-21-17)14-3-4-14)13-5-7-15(8-6-13)22-9-2-10-26(22,24)25/h5-8,11-12,14H,2-4,9-10H2,1H3,(H2,19,20,21,23)
NCI pathway
Reactome pathway
n/an/a 13n/an/an/an/a7.422
Pharmacia Italia
Assay Description
The biochemical activity of compounds was determined by incubation with specific enzymes and substrates in the presence ATP/[gamma-33P] ATP. After in...
J Med Chem 47: 3367-80 (2004)
Article DOI: 10.1021/jm031145u
BindingDB Entry DOI: 10.7270/Q2RX998G