BDBM7122 3-Aminopyrazole deriv. 37::N-(5-Cyclopropyl-1H-pyrazol-3-yl)-2-(4-pyrrolidin-1-ylphenyl)propanamide::N-(5-cyclopropyl-1H-pyrazol-3-yl)-2-[4-(pyrrolidin-1-yl)phenyl]propanamide
SMILES: CC(C(=O)Nc1cc(n[nH]1)C1CC1)c1ccc(cc1)N1CCCC1
InChI Key: InChIKey=PUQPISAECVJMHV-UHFFFAOYSA-N
Data: 1 IC50
PDB links: 1 PDB ID contains inhibitors having a similarity of 90% to this monomer.
Activity Spreadsheet -- Enzyme Inhibition Constant Data from BindingDB
Found 1 hit for monomerid = 7122
Trg + Lig
Ki
nM
ΔG°
kcal/mole
IC50
nM
Kd
nM
EC50/IC50
nM
koff
s-1
kon
M-1s-1
pHTemp
°C
Cyclin-Dependent Kinase 2 (CDK2)
(Homo sapiens (Human))
BDBM7122
(3-Aminopyrazole deriv. 37 | N-(5-Cyclopropyl-1H-py...)
Show SMILES CC(C(=O)Nc1cc(n[nH]1)C1CC1)c1ccc(cc1)N1CCCC1
Show InChI InChI=1S/C19H24N4O/c1-13(14-6-8-16(9-7-14)23-10-2-3-11-23)19(24)20-18-12-17(21-22-18)15-4-5-15/h6-9,12-13,15H,2-5,10-11H2,1H3,(H2,20,21,22,24)
NCI pathway
Reactome pathway
n/an/a 200n/an/an/an/a7.422
Pharmacia Italia
Assay Description
The biochemical activity of compounds was determined by incubation with specific enzymes and substrates in the presence ATP/[gamma-33P] ATP. After in...
J Med Chem 47: 3367-80 (2004)
Article DOI: 10.1021/jm031145u
BindingDB Entry DOI: 10.7270/Q2RX998G
3D
3D Structure (docked)