BDBM7148 3-Benzamidoaminopyrazole deriv. 25::4-bromo-N-[5-(propan-2-yl)-1H-pyrazol-3-yl]benzamide::CHEMBL430703::N-(5-Isopropyl-1H-pyrazol-3-yl)-4-bromobenzamide
SMILES: CC(C)c1cc(NC(=O)c2ccc(Br)cc2)[nH]n1
InChI Key: InChIKey=WATZRHFPUUTHEW-UHFFFAOYSA-N
Data: 2 IC50
Activity Spreadsheet -- Enzyme Inhibition Constant Data from BindingDB
Found 2 hits for monomerid = 7148
Trg + Lig
Ki
nM
ΔG°
kcal/mole
IC50
nM
Kd
nM
EC50/IC50
nM
koff
s-1
kon
M-1s-1
pHTemp
°C
Cyclin-dependent kinase 2
(Homo sapiens (Human))
BDBM7148
(3-Benzamidoaminopyrazole deriv. 25 | 4-bromo-N-[5-...)
Show SMILES CC(C)c1cc(NC(=O)c2ccc(Br)cc2)[nH]n1
Show InChI InChI=1S/C13H14BrN3O/c1-8(2)11-7-12(17-16-11)15-13(18)9-3-5-10(14)6-4-9/h3-8H,1-2H3,(H2,15,16,17,18)
NCI pathway
Reactome pathway
n/an/a 200n/an/an/an/an/an/a
Institute of Chemical Biology (CSIR)
Curated by ChEMBL
Assay Description
Inhibition of CDK2/Cyclin A (unknown origin)
Eur J Med Chem 43: 2807-18 (2008)
Article DOI: 10.1016/j.ejmech.2007.10.016
BindingDB Entry DOI: 10.7270/Q2MP5324
Cyclin-Dependent Kinase 2 (CDK2)
(Homo sapiens (Human))
BDBM7148
(3-Benzamidoaminopyrazole deriv. 25 | 4-bromo-N-[5-...)
Show SMILES CC(C)c1cc(NC(=O)c2ccc(Br)cc2)[nH]n1
Show InChI InChI=1S/C13H14BrN3O/c1-8(2)11-7-12(17-16-11)15-13(18)9-3-5-10(14)6-4-9/h3-8H,1-2H3,(H2,15,16,17,18)
NCI pathway
Reactome pathway
n/an/a 200n/an/an/an/an/an/a
Pharmacia Italia
Assay Description
The biochemical activity of compounds was determined by incubation with specific enzymes and substrates in the presence ATP/[gamma-33P] ATP. After in...
J Med Chem 47: 3367-80 (2004)
Article DOI: 10.1021/jm031145u
BindingDB Entry DOI: 10.7270/Q2RX998G